Project

General

Profile

Issues

Filters

Apply Clear

# Project Tracker Status Subject Assignee Updated
12407 Ruby master Bug Open 2 failures of TestMkmf::TestConvertible 05/20/2016 02:30 PM Actions
14755 Ruby master Bug Open Aborted (core dumped) 05/12/2018 06:20 PM Actions
13249 Ruby master Bug Assigned Access modifiers don't have an effect inside class methods in Ruby >= 2.3 ko1 (Koichi Sasada) 08/25/2019 12:23 AM Actions
14408 Ruby master Bug Assigned Add hash argument description for GC.stat and GC.latest_gc_info document ko1 (Koichi Sasada) 08/09/2018 10:44 AM Actions
8994 Ruby master Bug Open add methods for Float to get if an NaN is quiet or not, also add class methods for Float to "generate" an quiet NaN and an loud NaN 10/08/2013 04:45 PM Actions
14631 Ruby master Bug Open Add support for long paths in Windows 10 when support is enabled in the OS 03/26/2018 11:43 AM Actions
15779 Ruby master Bug Open After NoMemoryError, ruby freezes and takes 100% CPU 05/16/2019 05:07 PM Actions
11514 Ruby master Bug Open AIX6.1 - Ruby 2.2.3 - Segmentation fault in :byteslice 09/18/2015 07:39 AM Actions
11533 Ruby master Bug Feedback AIX6.1 - Ruby 2.2.3 - TestMkmf::TestConvertible#test_typeof_builtin fails 09/17/2015 03:23 PM Actions
11189 Ruby master Bug Open alias prepended module matz (Yukihiro Matsumoto) 08/12/2019 10:59 PM Actions
8973 Ruby master Bug Open Allow to configure archlibdir for multiarch nobu (Nobuyoshi Nakada) 06/26/2014 10:06 AM Actions
9274 Ruby master Bug Open A lot of SystemStackError on Windows 8.1 with MSVC 2013 12/23/2013 08:16 AM Actions
15627 Ruby master Bug Open Appearance of custom singleton classes 03/10/2019 04:40 PM Actions
15852 Ruby master Bug Open APPLICATION_VERIFIER_LOCKS_LOCK_IN_FREED_HEAP on exiting ruby 05/15/2019 09:52 PM Actions
13918 Ruby master Bug Assigned Appveyor failure - svn 59961 Use https instead of ftp for libffi downloading hsbt (Hiroshi SHIBATA) 09/19/2017 01:44 PM Actions
15038 Ruby master Bug Open Appveyor MinGW - bundled gems missing? 08/28/2018 04:17 PM Actions
15253 Ruby master Bug Feedback Arduinoとの接続においてSocket.tcp_server_loop中で$stderr.puts、pなどが使用できない 10/28/2018 11:48 AM Actions
10475 Ruby master Bug Open Array#flatten should not accept a nil argument matz (Yukihiro Matsumoto) 11/25/2014 01:03 AM Actions
9291 Ruby master Bug Open array splatting a nil works, but hash splatting a nil does not matz (Yukihiro Matsumoto) 08/11/2014 09:42 AM Actions
13164 Ruby master Bug Open A second `SystemStackError` exception results in `Segmentation fault (core dumped)` 04/14/2017 01:05 PM Actions
10495 Ruby master Bug Open Attaching lldb to a program running `sleep` hangs the VM 01/05/2018 09:01 PM Actions
9815 Ruby master Bug Feedback attr_reader doesn't warn on a uninitialized instance variable matz (Yukihiro Matsumoto) 01/05/2018 09:00 PM Actions
11055 Ruby master Bug Assigned autoload resets private_constant matz (Yukihiro Matsumoto) 08/12/2019 04:02 AM Actions
15717 Ruby master Bug Open Backport #15270 to Ruby 2.5.x 04/24/2019 06:00 AM Actions
16034 Ruby master Bug Open Backport 5d33f787169bcc3594d2264726695d58c4a06899 to Ruby 2.6 08/02/2019 12:05 AM Actions
16138 Ruby master Bug Open Backport Struct.new empty option hash fix to 2.5 and 2.6 09/04/2019 09:35 AM Actions
14558 Ruby master Bug Open "Backtrace in reverse order" always upsets my brain! 02/28/2018 09:41 PM Actions
9836 Ruby master Bug Feedback Bad Implementation of Time.strptime 08/11/2019 07:36 PM Actions
12961 Ruby master Bug Assigned Bad value for range using infinity for Date or Time matz (Yukihiro Matsumoto) 08/25/2019 05:11 PM Actions
16185 Ruby master Bug Open basictest failure on AIX 6.1 for 64bit build kanemoto (Yutaka Kanemoto) 10/15/2019 12:05 AM Actions
12106 Ruby master Bug Assigned Behavior of double splatting of hashes with non symbol key is different according to splatted hash position nobu (Nobuyoshi Nakada) 03/16/2016 09:41 AM Actions
8826 Ruby master Bug Assigned BigDecimal#div and #quo different behavior and inconsistencies mrkn (Kenta Murata) 05/20/2018 06:55 PM Actions
12780 Ruby master Bug Assigned BigDecimal#round returns different types depending on argument matz (Yukihiro Matsumoto) 11/25/2016 01:59 PM Actions
13754 Ruby master Bug Assigned bigdecimal with lower precision that Float mrkn (Kenta Murata) 05/20/2018 09:16 PM Actions
15620 Ruby master Bug Assigned Block argument usage affects lambda semantic ko1 (Koichi Sasada) 07/30/2019 07:30 AM Actions
10684 Ruby master Bug Open Block arity changes through Enumerable methods 01/01/2015 12:03 AM Actions
16143 Ruby master Bug Open BOM UTF-8 is not removed after rewind 10/10/2019 09:59 PM Actions
14870 Ruby master Bug Open Both TracePoint's :call and :c_call filters seem to skip a lot of builtin methods nobu (Nobuyoshi Nakada) 06/26/2018 02:26 PM Actions
13670 Ruby master Bug Feedback [BUG] Bus Error at 0xefce7b (armv7l) (ruby 2.3.4p301) 06/21/2018 08:10 AM Actions
8836 Ruby master Bug Assigned [BUG] Bus Error with bundler on large Gemfile when resolving dependencies hsbt (Hiroshi SHIBATA) 05/15/2019 12:51 PM Actions
14843 Ruby master Bug Assigned [BUG] Illegal instruction at 0x000000010c7acc0a tenderlovemaking (Aaron Patterson) 06/16/2018 09:35 PM Actions
12179 Ruby master Bug Open Build failure due to VPATH expansion 04/14/2016 01:55 AM Actions
9189 Ruby master Bug Assigned Build failure on Windows in case of nonascii TEMP environment. 01/05/2018 09:00 PM Actions
9312 Ruby master Bug Feedback Build the ruby executable in bin/ nobu (Nobuyoshi Nakada) 02/07/2014 02:27 AM Actions
10213 Ruby master Bug Assigned bundled gems ignored by make install hsbt (Hiroshi SHIBATA) 09/09/2014 01:01 PM Actions
16013 Ruby master Bug Feedback Bundler... hsbt (Hiroshi SHIBATA) 07/20/2019 01:34 AM Actions
15359 Ruby master Bug Assigned Bundler help is not properly integrated hsbt (Hiroshi SHIBATA) 12/01/2018 01:01 AM Actions
16186 Ruby master Bug Open Calling Net::HTTP from within an #inspect implementation hang when invoked from p kosaki (Motohiro KOSAKI) 09/29/2019 05:31 PM Actions
16194 Ruby master Bug Feedback Can not compile the recent ruby 2.6.5 release due to some openssl-related issue (see issue description) 10/02/2019 01:28 AM Actions
16236 Ruby master Bug Open Cannot handle logrotate on Windows when one file is written from multi process/thread 10/04/2019 03:02 PM Actions
15819 Ruby master Bug Open cannot read document of File::NULL with "ri File::NULL" 05/03/2019 09:04 AM Actions
12555 Ruby master Bug Open Cannot resume a fiber that was earlier transferred from, then transferred back to, and then yielded 07/09/2016 11:10 PM Actions
9664 Ruby master Bug Open cannot resume transferred Fiber even if it should resume 12/01/2017 09:40 PM Actions
13903 Ruby master Bug Open cant compile ruby with /MT on windows 09/18/2017 07:19 AM Actions
13752 Ruby master Bug Assigned Can't observe sibling refinements 07/18/2017 06:27 AM Actions
16243 Ruby master Bug Open case/when is slower than if on MRI 10/07/2019 08:58 AM Actions
13708 Ruby master Bug Open catastrophic slow compilation of defined-defined sequence has no chance to ^C 07/03/2017 03:35 AM Actions
14732 Ruby master Bug Open CGI.unescape returns different instance between Ruby 2.3 and 2.4 05/03/2018 01:33 AM Actions
13962 Ruby master Bug Assigned Change http://unicode.org to https duerst (Martin Dürst) 12/12/2017 02:11 PM Actions
15334 Ruby master Bug Open child_info_fork::abort: address space needed by 'emoji_iso2022_kddi.so' on cygwin nobu (Nobuyoshi Nakada) 12/10/2018 07:14 AM Actions
14541 Ruby master Bug Open Class variables have broken semantics, let's fix them 01/03/2019 03:26 PM Actions
11706 Ruby master Bug Open Clean up files etc/unicode/name2ctype.{h.blt,kwd,src} nobu (Nobuyoshi Nakada) 01/05/2016 12:26 PM Actions
11142 Ruby master Bug Open Command line argument parser on windows handles double quotes inconsistently. usa (Usaku NAKAMURA) 05/12/2015 04:09 PM Actions
7676 Ruby master Bug Open Comparison of Float::NAN in array behaves unexpectedly matz (Yukihiro Matsumoto) 01/16/2016 11:28 AM Actions
11878 Ruby master Bug Assigned Comparison of prepended modules matz (Yukihiro Matsumoto) 04/13/2016 07:02 AM Actions
5179 Ruby master Bug Assigned Complex#rationalize and to_r with approximate zeros mrkn (Kenta Murata) 03/18/2012 06:46 PM Actions
13966 Ruby master Bug Open configure.in still needed ?! nobu (Nobuyoshi Nakada) 10/07/2017 08:25 AM Actions
9010 Ruby master Bug Assigned ./configure --prefix= cannot handle directories with spaces nobu (Nobuyoshi Nakada) 03/18/2015 10:25 PM Actions
12392 Ruby master Bug Open configure --with-sitedir=no --with-sitearchdir=no --with-vendordir=no --with-vendorarchdir=no が機能しない 05/18/2016 03:14 PM Actions
15928 Ruby master Bug Open Constant declaration does not conform to JIS 3017:2013 06/16/2019 02:37 PM Actions
15980 Ruby master Bug Assigned Coverage shows while/until after raise if/unless as uncovered line mame (Yusuke Endoh) 07/03/2019 03:48 AM Actions
9659 Ruby master Bug Feedback crash in FIPS mode after unchecked algo->init_func failure 01/05/2018 09:00 PM Actions
16191 Ruby master Bug Feedback Crash when setting conditional to false 09/30/2019 11:47 PM Actions
10416 Ruby master Bug Open Create mechanism for updating of Unicode data files downstreams when we want nobu (Nobuyoshi Nakada) 01/05/2018 09:01 PM Actions
11183 Ruby master Bug Open Cumulative error on Complex::I ** 100000000000000000000000000000000 05/26/2015 08:32 AM Actions
9409 Ruby master Bug Open Cygwin で "filesystem" の encoding が正しくないケース 01/15/2014 02:07 AM Actions
13999 Ruby master Bug Assigned Cygwin 環境で ripper_state_lex.rb がコアダンプする aycabta (aycabta .) 11/06/2018 04:51 PM Actions
11177 Ruby master Bug Open DATAでEOF文字以降が読めない 05/25/2015 03:49 AM Actions
15712 Ruby master Bug Feedback DateTime#=== should be defined and compare date and time instead of just the date 03/22/2019 05:36 PM Actions
15598 Ruby master Bug Open Deadlock on mutual reference of autoloaded constants 03/20/2019 10:58 AM Actions
6360 Ruby master Bug Assigned Debug information build even without requesting it nobu (Nobuyoshi Nakada) 01/05/2018 09:00 PM Actions
10314 Ruby master Bug Open Default argument lookup fails in Ruby 2.2 for circular shadowed variable names nobu (Nobuyoshi Nakada) 08/11/2019 11:26 PM Actions
12368 Ruby master Bug Open default encoding of Integer#chr 05/17/2016 08:28 AM Actions
11213 Ruby master Bug Open defined?(super) ignores respond_to_missing? matz (Yukihiro Matsumoto) 06/02/2015 08:11 PM Actions
12251 Ruby master Bug Open DelegateClass(OpenStruct) behavior in 2.3.0 different from 2.2 04/05/2016 07:45 PM Actions
9542 Ruby master Bug Open Delegator does not delegate protected methods 11/05/2014 12:59 AM Actions
9573 Ruby master Bug Open descendants of a module don't gain its future ancestors, but descendants of a class, do 06/05/2014 06:16 AM Actions
11808 Ruby master Bug Open Different behavior between Enumerable#grep and Array#grep ko1 (Koichi Sasada) 07/11/2019 06:04 AM Actions
14456 Ruby master Bug Open Dir.glob with FNM_CASEFOLD gives ArgumentError: invalid byte sequence in UTF-8 02/07/2018 08:36 PM Actions
15661 Ruby master Bug Open Disallow concurrent Dir.chdir with block 03/14/2019 08:42 PM Actions
6400 Ruby master Bug Assigned dl/callback with fiddle occurs SEGV on NetBSD amd64 tenderlovemaking (Aaron Patterson) 08/15/2013 05:06 AM Actions
10747 Ruby master Bug Assigned DNS resolution should fall back to TCP on Errno::EACCES akr (Akira Tanaka) 07/08/2019 01:55 AM Actions
16110 Ruby master Bug Open Doesn't detect deadlock on Ruby 2.4 and 2.5 on Windows 08/19/2019 02:28 PM Actions
8782 Ruby master Bug Assigned Don't set rl_getc_function on editline kouji (Kouji Takao) 01/05/2018 09:00 PM Actions
15828 Ruby master Bug Open DOTfiles and DOTfolders aren't allowed in $HOME folder on Haiku 05/06/2019 10:42 PM Actions
8039 Ruby master Bug Assigned DRB/dRuby server throws an exception when probed on its port seki (Masatoshi Seki) 08/08/2019 11:01 PM Actions
12838 Ruby master Bug Open Duplication of UDP packets for DNS responses causing "no address" results for valid hostnames 10/14/2016 03:20 PM Actions
15315 Ruby master Bug Open ec_switch can still lose interrupts ko1 (Koichi Sasada) 11/20/2018 09:32 AM Actions
15033 Ruby master Bug Open Encoding fallback uses wrong character when multiple conversions are required 08/27/2018 09:19 PM Actions
14823 Ruby master Bug Feedback Endless Range Excluding End 06/05/2018 02:31 PM Actions
15404 Ruby master Bug Open Endless range has inconsistent chaining behaviour 01/30/2019 09:54 PM Actions
14824 Ruby master Bug Open Endless Range Support in irb 06/05/2018 10:45 AM Actions
13220 Ruby master Bug Feedback Enhance support of Unicode strings manipulation 06/14/2019 08:58 PM Actions
14015 Ruby master Bug Open Enumerable & Hash yielding arity matz (Yukihiro Matsumoto) 06/01/2018 03:10 AM Actions
15613 Ruby master Bug Open Enumerator::Chain#each doesn't relay block signature nobu (Nobuyoshi Nakada) 08/28/2019 11:46 PM Actions
10534 Ruby master Bug Open Enumerator methods other than "next" do not always respect "peek" 06/10/2015 07:18 AM Actions
9715 Ruby master Bug Open ENV data yield ASCII-8BIT encoded strings under Windows with unicode username cruby-windows 06/23/2016 11:38 PM Actions
16173 Ruby master Bug Open ENV.delete returns nil when name does not exist and block given 10/01/2019 10:27 AM Actions
15044 Ruby master Bug Open ENV encoding not UTF-8 by default 08/29/2018 06:40 PM Actions
11274 Ruby master Bug Open Equality inconsistency between Method and UnboundMethod matz (Yukihiro Matsumoto) 06/17/2015 03:12 PM Actions
12590 Ruby master Bug Open Error compiling parse.c on cygwin nobu (Nobuyoshi Nakada) 07/18/2016 04:09 AM Actions
14971 Ruby master Bug Open error: implicit declaration of function ‘rb_vm_call0 nobu (Nobuyoshi Nakada) 09/06/2018 03:53 AM Actions
11840 Ruby master Bug Open Error with "make check" on Cygwin nobu (Nobuyoshi Nakada) 12/18/2015 12:48 PM Actions
16251 Ruby master Bug Open Evaluation in binding differs from ruby execution 10/15/2019 01:48 PM Actions
12551 Ruby master Bug Assigned Exception accessing file with long path on windows usa (Usaku NAKAMURA) 03/26/2018 08:18 PM Actions
13882 Ruby master Bug Assigned Exception in `ensure` stops threads from exiting ko1 (Koichi Sasada) 02/26/2018 06:26 PM Actions
13930 Ruby master Bug Open Exception is caught in rescue above ensure 10/28/2018 09:13 AM Actions
5618 Ruby master Bug Assigned Exceptions cause DRb connection to be closed seki (Masatoshi Seki) 08/14/2019 11:53 PM Actions
14479 Ruby master Bug Open Exceptions raised from a :call tracepoint can sometimes be "rescued" inside the method 02/15/2018 03:09 AM Actions
14900 Ruby master Bug Open Extra allocation in String#byteslice 07/08/2018 11:35 AM Actions
12666 Ruby master Bug Assigned Fatal error: glibc detected an invalid stdio handle tenderlovemaking (Aaron Patterson) 12/21/2016 05:52 AM Actions
595 Ruby master Bug Assigned Fiber ignores ensure clause ioquatix (Samuel Williams) 01/14/2019 07:32 AM Actions
11579 Ruby master Bug Open Fiddle.win32_last_error after calling Fiddle::Function#call isn't GetLastError() tenderlovemaking (Aaron Patterson) 03/22/2016 11:08 AM Actions
15267 Ruby master Bug Open File.basename + File.extname does not restore the original name 08/13/2019 11:49 PM Actions
9713 Ruby master Bug Assigned __FILE__ return unexpected encoding - breaks Dir.glob cruby-windows 12/04/2015 02:31 PM Actions
14591 Ruby master Bug Open Files with invalid multi-byte characters will cause Find::find() to raise EINVAL exception 08/27/2019 10:20 AM Actions
4436 Ruby master Bug Open FileUtils verbose mode prints output to stderr 07/31/2019 07:56 PM Actions
13151 Ruby master Bug Open File.writable? doesn't report correctly if a directory is writable on Windows. 01/23/2017 05:46 PM Actions
14607 Ruby master Bug Open Fix use of the rb_profile_frames start parameter 04/27/2018 12:30 AM Actions
6120 Ruby master Bug Assigned Float and BigDecimal bug in remainder in corner cases marcandre (Marc-Andre Lafortune) 12/25/2017 06:15 PM Actions
14635 Ruby master Bug Feedback Float#round(n) returns a wrong result when n is big 03/27/2018 01:57 PM Actions
16044 Ruby master Bug Open Float::ROUNDS (FLT_ROUNDS) should not be a constant. 08/06/2019 05:13 PM Actions
9595 Ruby master Bug Assigned Float#to_d inconsistent between 2.0.0 and 2.1.1 mrkn (Kenta Murata) 03/05/2014 10:25 PM Actions
12599 Ruby master Bug Open For CLang, increase inline-threshold to get 7%-10% speedup of optcarrot 08/25/2016 08:55 PM Actions
15423 Ruby master Bug Open fork leapfrog leaks memory on FreeBSD 11.2 12/16/2018 02:28 PM Actions
12667 Ruby master Bug Assigned full_gem_path is incorrect for core modules hsbt (Hiroshi SHIBATA) 03/23/2019 07:52 AM Actions
11164 Ruby master Bug Assigned Garbage collector in Ruby 2.2 provokes unexpected CoW authorNari (Narihiro Nakamura) 05/26/2015 06:29 AM Actions
14275 Ruby master Bug Open GC not aggressive enough 01/03/2018 09:18 AM Actions
9629 Ruby master Bug Open GC::Profiler.total_time under-reports GC time compared to dtrace GC probe measurement 03/14/2014 08:44 PM Actions
8810 Ruby master Bug Open GDBM.open内で処理がブロックしたらTimeout.timeout が効かない 08/24/2013 08:29 AM Actions
15097 Ruby master Bug Open Gem install fails on Ruby 2.5.1 with Cygwin (get_dns_server_list undefined) 09/10/2018 07:18 PM Actions
10919 Ruby master Bug Assigned [gem install] installs multipe platforms hsbt (Hiroshi SHIBATA) 07/30/2019 07:44 AM Actions
14663 Ruby master Bug Open getting "killed string.c" rdoc failed while trying to make ruby-2_5_1 04/04/2018 10:03 PM Actions
15204 Ruby master Bug Open globbing should be prevented when wildcard is surrounded by double quotes in the ruby's command line 10/05/2018 08:29 AM Actions
9921 Ruby master Bug Open gmtime_r, win32.h, and <string> 06/09/2014 02:42 AM Actions
14804 Ruby master Bug Open GzipReader cannot read Freebase dump (but gzcat/zless can) 06/01/2018 10:45 PM Actions
15827 Ruby master Bug Open Haiku: SSL tests failing 05/05/2019 05:31 PM Actions
12706 Ruby master Bug Open Hash#each yields inconsistent number of args 08/25/2016 06:43 PM Actions
16187 Ruby master Bug Open Hash#replace no longer rehashes keys for small (array table) hashes 09/27/2019 10:35 PM Actions
12671 Ruby master Bug Open Hash#to_proc result is not a lambda, but enforces arity 08/12/2016 06:46 AM Actions
14745 Ruby master Bug Open High memory usage when using String#replace with IO.copy_stream 05/18/2018 06:52 PM Actions
12538 Ruby master Bug Feedback hostsを書き換えてwebrickで書いたプロキシ―に繋いでいるとrubyが落ちる 07/04/2016 09:24 AM Actions
6087 Ruby master Bug Assigned How should inherited methods deal with return values of their own subclass? matz (Yukihiro Matsumoto) 07/14/2012 04:44 PM Actions
11450 Ruby master Bug Open HTTPHeader.content_range throws error on non-byte units 09/29/2015 12:50 PM Actions
10484 Ruby master Bug Open http response throw error with broken gzip compressed block(but can decompress) 11/07/2014 08:13 AM Actions
15856 Ruby master Bug Assigned Idempotent performance of Kernel.require with many activated gems is slow hsbt (Hiroshi SHIBATA) 05/21/2019 09:52 PM Actions
13000 Ruby master Bug Feedback Implement Set#include? with Hash#include? knu (Akinori MUSHA) 11/28/2017 05:45 AM Actions
14835 Ruby master Bug Open Impossible to know whether an exception was rescued or not using TracePoint 06/08/2018 08:58 AM Actions
10561 Ruby master Bug Open Improve function of Thread::Backtrace::Location #path and #absolute_path 02/23/2015 10:11 AM Actions
12015 Ruby master Bug Open Improving code coverage visibility 01/23/2016 06:27 AM Actions
7844 Ruby master Bug Assigned include/prepend satisfiable module dependencies are not satisfied matz (Yukihiro Matsumoto) 08/08/2019 05:09 PM Actions
16031 Ruby master Bug Open Inconsistency between Date::strptime and Time::strptime at the end of a month 07/31/2019 07:27 PM Actions
14895 Ruby master Bug Open Inconsistent constant names when using const_set on a singleton class 07/05/2018 09:10 PM Actions
13331 Ruby master Bug Assigned Inconsistent conversion of Float into Decimal mrkn (Kenta Murata) 03/29/2017 02:16 PM Actions
13153 Ruby master Bug Open Inconsistent sprintf formatting for 0 value 01/26/2017 02:03 PM Actions
11669 Ruby master Bug Assigned inconsitent behavior of refining frozen class matz (Yukihiro Matsumoto) 11/09/2015 05:38 AM Actions
15188 Ruby master Bug Open Incorrect warning "assigned but unused variable" when using ripper with $VERBOSE = true 08/27/2019 07:02 PM Actions
9944 Ruby master Bug Assigned in ruby for windows in "system" a redirection to append a file works incorrectly cruby-windows 01/05/2018 09:00 PM Actions
14391 Ruby master Bug Assigned Integer#digitsが遅い mrkn (Kenta Murata) 01/27/2018 02:24 AM Actions
14437 Ruby master Bug Open Integer == doesn't work with coerce since 2.4 (and != since 1.9). Should it? 02/04/2018 02:38 PM Actions
16195 Ruby master Bug Assigned Invalid certificate on https://ruby-lang.org/ hsbt (Hiroshi SHIBATA) 10/02/2019 07:22 AM Actions
9431 Ruby master Bug Open In windows ruby IO.write returns count of bytes without count of CR character 01/19/2014 09:33 PM Actions
12280 Ruby master Bug Open IO.copy_stream(IO, IO) fails with "pread() not implemented" 04/28/2016 05:51 AM Actions
8445 Ruby master Bug Assigned IO.open and IO#set_enconding does not support :fallback option akr (Akira Tanaka) 01/05/2018 09:00 PM Actions
10009 Ruby master Bug Open IO operation is 10x slower in multi-thread environment ko1 (Koichi Sasada) 05/21/2015 07:19 AM Actions
14505 Ruby master Bug Feedback IO.popen / Open3.popen2 / backtick subprocess remains blocked 02/22/2018 07:11 AM Actions
14434 Ruby master Bug Open IO#reopen fails after EPIPE 02/02/2018 10:32 AM Actions
15367 Ruby master Bug Open IO.select is not resumed when io-object gets closed 12/03/2018 10:22 AM Actions
10417 Ruby master Bug Open IO#set_encoding without int_enc doesn't keep current internal encoding 10/22/2014 05:42 PM Actions
14400 Ruby master Bug Feedback IO#ungetc and IO#ungetbyte documentation is inconsistent with the behavior akr (Akira Tanaka) 02/21/2018 12:26 AM Actions
11531 Ruby master Bug Open IPAddr#== implements wrong logic 11/23/2016 05:40 PM Actions
14119 Ruby master Bug Assigned IPAddr#include? does not seem to support the subnet mask knu (Akinori MUSHA) 11/20/2017 05:42 AM Actions
10911 Ruby master Bug Assigned IPAddr.new should ignore zone identifiers knu (Akinori MUSHA) 03/20/2019 12:40 PM Actions
15187 Ruby master Bug Open IPv6 x-forwarded-host results in "bad URI" error 08/27/2019 05:24 AM Actions
9876 Ruby master Bug Assigned IRB::Context output_method is not used keiju (Keiju Ishitsuka) 07/03/2014 03:14 AM Actions
14094 Ruby master Bug Open IRB does not obey frame-level visibility modifiers 11/09/2017 04:46 PM Actions
14563 Ruby master Bug Open irb in irb raises a FATAL error 06/19/2019 09:38 PM Actions
9877 Ruby master Bug Assigned IRB::OutputMethod defines "pp", but it's actually "p" keiju (Keiju Ishitsuka) 07/03/2014 03:15 AM Actions
9931 Ruby master Bug Assigned irb: Really weird behavior for x = "#{x\"}" (ex: irb(main:009:-4)) keiju (Keiju Ishitsuka) 07/11/2019 04:10 PM Actions
13654 Ruby master Bug Assigned irb save-history extension is not concurrency-safe keiju (Keiju Ishitsuka) 07/14/2017 09:28 AM Actions
9955 Ruby master Bug Assigned issue building dll on mingw, library not found nobu (Nobuyoshi Nakada) 01/05/2018 09:00 PM Actions
12388 Ruby master Bug Open Iterating second dbm enum causes first dbm enum to stop 05/16/2016 02:49 PM Actions
14160 Ruby master Bug Open JSON#generate documentation wrong/misleading 08/26/2019 12:25 AM Actions
16004 Ruby master Bug Open Kernel#lambda captured with Kernel#method doesn't create lambdas 07/15/2019 12:52 PM Actions
12485 Ruby master Bug Open Kernel.Rational raises TypeError though given denominator returns 1 by to_int 07/25/2019 03:29 PM Actions
9245 Ruby master Bug Open Kernel::system gives wrong output for utf-8 characters on windows under utf-8 console cruby-windows 12/12/2013 08:47 PM Actions
9435 Ruby master Bug Open Kernel.system problem 02/07/2014 03:40 AM Actions
8507 Ruby master Bug Feedback Keyword splat does not convert arg to Hash matz (Yukihiro Matsumoto) 01/05/2018 09:00 PM Actions
11480 Ruby master Bug Open killed by SIGIOT (signal 6) on fork 10/06/2015 10:28 AM Actions
14267 Ruby master Bug Open Lazy proc allocation introduced in #14045 creates regression 01/02/2018 06:47 AM Actions
15787 Ruby master Bug Feedback LoadError by EPERM on read-only volume 05/05/2019 03:57 PM Actions
8677 Ruby master Bug Open $LOAD_PATH did not encoded into the "internal encoding" 09/25/2013 12:12 PM Actions
16043 Ruby master Bug Open `$LOAD_PATH.resolve_feature_path` should not raise 08/04/2019 01:43 PM Actions
12468 Ruby master Bug Open Logger: Can not rotate (log shifting failed. closed stream) 06/07/2016 12:27 PM Actions
10965 Ruby master Bug Feedback logger.rb may not daily rotate sonots (Naotoshi Seo) 08/22/2019 03:27 PM Actions
9115 Ruby master Bug Assigned Logger traps all exceptions; breaks Timeout sonots (Naotoshi Seo) 08/20/2019 12:47 PM Actions
14543 Ruby master Bug Assigned `make commit` show error of `common-srcs` nobu (Nobuyoshi Nakada) 06/02/2018 04:17 AM Actions
14826 Ruby master Bug Open make: *** [.ext/include/sparc-solaris2.10/rb_mjit_min_header-2.6.0.h] Error 1 on Solaris 10 with very old gcc3 06/05/2018 02:02 PM Actions
9366 Ruby master Bug Assigned "make -j32 check TESTS=-j32" occasionally fails on rubygems/specification hsbt (Hiroshi SHIBATA) 07/26/2018 02:13 AM Actions
15579 Ruby master Bug Assigned make step when building ruby 2.4.5 on AIX 7.1 results in a Segmentation fault : ruby-2.4.5/lib/rdoc/markup/parser.rb:325 cruby-aix 02/02/2019 06:34 AM Actions
12440 Ruby master Bug Feedback make test-all is not working on cygwin nobu (Nobuyoshi Nakada) 05/31/2016 09:46 AM Actions
4434 Ruby master Bug Feedback make test-all "-j10000" のように大きな並列数を与えると異常終了 sorah (Sorah Fukumori) 12/25/2017 06:14 PM Actions
10433 Ruby master Bug Feedback make test-all stops at [ 401/16011] FTPTest#test_list_read_timeout-exceeded nobu (Nobuyoshi Nakada) 07/22/2019 10:12 PM Actions
15244 Ruby master Bug Feedback Method #extname return empty string if filename is dot ('.') 09/24/2019 07:08 PM Actions
11188 Ruby master Bug Open Method#inspect for chaining alias methods matz (Yukihiro Matsumoto) 08/12/2019 10:23 PM Actions
7892 Ruby master Bug Open MIME encoding bug of NKF.nkf naruse (Yui NARUSE) 12/25/2017 06:15 PM Actions
15754 Ruby master Bug Open MinGW build/compile failure with Ruby 2.5.5, but 2.6.2 & trunk ok 04/08/2019 06:11 PM Actions
14906 Ruby master Bug Open MinGW failure - TestIO#test_copy_stream_no_busy_wait 07/12/2018 03:52 AM Actions
14957 Ruby master Bug Open MinGW, gcc 8.2.0, bootstraptest test_thread.rb - failure ? 08/03/2018 02:46 PM Actions
13556 Ruby master Bug Open MinGW readline Alt / Meta keys 07/16/2017 11:43 PM Actions
13298 Ruby master Bug Assigned mingw SEGV TestEnumerable#test_callcc nobu (Nobuyoshi Nakada) 03/13/2017 08:56 AM Actions
13500 Ruby master Bug Open MinGW TestArity#test_proc_err_mess stops testing 04/26/2017 03:27 PM Actions
13485 Ruby master Bug Open MinGW TestEnumerable#test_callcc SEGV info 04/19/2017 04:17 PM Actions
13542 Ruby master Bug Open MinGW trunk Builds - Summary of Issues 05/19/2017 07:04 PM Actions
13549 Ruby master Bug Open MinGW / Windows encoding - Two issues 07/17/2017 12:04 AM Actions
14480 Ruby master Bug Open miniruby crashing when compiled with -O2 or -O1 on aarch64 04/10/2018 12:04 AM Actions
8299 Ruby master Bug Assigned Minor error in float parsing nobu (Nobuyoshi Nakada) 04/26/2013 07:35 AM Actions
11180 Ruby master Bug Open Missing lines with Zlib::GzipReader 05/26/2015 09:33 AM Actions
15599 Ruby master Bug Open Mixing autoload and require causes deadlock and incomplete definition. 02/12/2019 01:40 PM Actions
9760 Ruby master Bug Open mkmf does not allow for linking against custom libraries when a system library is present 05/24/2016 08:11 AM Actions
9213 Ruby master Bug Assigned mkmf.rb emits invalid destination directory name for mswin32/64 nobu (Nobuyoshi Nakada) 01/05/2018 09:00 PM Actions
14704 Ruby master Bug Open Module#ancestors looks wrong when a module is both included and prepended in the same class. 04/20/2018 03:23 PM Actions
8841 Ruby master Bug Open Module#included_modules and prepended modules matz (Yukihiro Matsumoto) 12/25/2017 06:15 PM Actions
11779 Ruby master Bug Feedback Module#using does not make sense as a method matz (Yukihiro Matsumoto) 04/26/2018 11:05 AM Actions
6407 Ruby master Bug Assigned Most Test Failure for BigDecimal on 64bit Windows, any GCC parameter needed? nobu (Nobuyoshi Nakada) 12/25/2017 06:15 PM Actions
13125 Ruby master Bug Open MRI has too much Qtrue : Qfalse; 01/21/2017 07:24 AM Actions
14884 Ruby master Bug Feedback msys2 mingw32 'rake' has unexpected text at top of file 07/04/2018 11:20 PM Actions
15052 Ruby master Bug Open must not optimize `foo(**{})` out 08/31/2018 12:09 PM Actions
15834 Ruby master Bug Open Mutating the result of SortedSet.to_a mutates the original set, potentially violating the set's guarantees knu (Akinori MUSHA) 05/07/2019 06:56 PM Actions
14012 Ruby master Bug Open NameError is raised when use class variables in Refinements 10/13/2017 01:43 PM Actions
14413 Ruby master Bug Feedback `-n` and `-p` flags break when stdout is closed 01/29/2018 02:17 AM Actions
11438 Ruby master Bug Open native_thread_init_stack() get machine.stack_start unequal to thread's stack start address, x86 win32 cruby-windows 08/13/2015 07:31 AM Actions
12919 Ruby master Bug Open Net::FTP does not have a default open_timeout 11/17/2016 02:12 AM Actions
14972 Ruby master Bug Open Net::HTTP inconsistently raises EOFError when peer closes the connection 08/12/2019 09:13 PM Actions
9459 Ruby master Bug Assigned Net::HTTP initializes openssl library after TCP connection is established naruse (Yui NARUSE) 01/05/2018 09:00 PM Actions
15517 Ruby master Bug Open Net::HTTP not recognizing valid UTF-8 01/20/2019 01:15 AM Actions
12055 Ruby master Bug Assigned `NET::HTTPResponse` is not deflating responses with custom `Content-Range` header naruse (Yui NARUSE) 06/27/2019 10:27 PM Actions
14051 Ruby master Bug Assigned net/imap issue on idle method with an empty block shugo (Shugo Maeda) 10/25/2017 04:41 AM Actions
12708 Ruby master Bug Open Net::IMAP : Mail To address is not correct when uid_fetch is called. 08/26/2016 01:57 PM Actions
12436 Ruby master Bug Open newline argument of File.open seems not respected on Windows 05/29/2016 11:28 AM Actions
10929 Ruby master Bug Open NilClass#to_proc and & don't mix? matz (Yukihiro Matsumoto) 03/08/2015 10:43 PM Actions
9246 Ruby master Bug Assigned NoMemoryError is occurred by simple addition of BigDecimal mrkn (Kenta Murata) 12/25/2017 06:15 PM Actions
8982 Ruby master Bug Feedback NoMethodError#message produces surprising output when #inspect is defined on an anonymous class 08/15/2019 11:56 PM Actions
9737 Ruby master Bug Open Non-ASCII characters in the path to ruby executable break require paths cruby-windows 04/15/2014 08:28 AM Actions
11202 Ruby master Bug Open No warning when a link to an original method body was removed matz (Yukihiro Matsumoto) 06/01/2015 10:20 AM Actions
10453 Ruby master Bug Assigned NUM2CHR() does not perform additional bounds checks matz (Yukihiro Matsumoto) 08/12/2019 04:48 AM Actions
15589 Ruby master Bug Open `Numeric#zero?` is much slower than `== 0` k0kubun (Takashi Kokubun) 02/07/2019 01:07 AM Actions
13397 Ruby master Bug Open #object_id should not be signed 12/13/2018 01:09 AM Actions
4443 Ruby master Bug Assigned odd evaluation order in a multiple assignment ko1 (Koichi Sasada) 01/24/2018 08:36 AM Actions
16159 Ruby master Bug Open Off by 1 errors from time_params tests 09/11/2019 05:35 PM Actions
12506 Ruby master Bug Assigned On cygwin, Feature #5994 does not work nobu (Nobuyoshi Nakada) 04/28/2017 01:45 PM Actions
11582 Ruby master Bug Open On Solaris, Rational#** returns -Infinity for Rational(0) when passed a negative Float 10/13/2015 03:12 AM Actions
14378 Ruby master Bug Open On windows, RUBY_FIXNUM_MAX of 64 bits ruby is 32 bits 01/21/2018 06:51 AM Actions
11022 Ruby master Bug Assigned opening an eigenclass does not change the class variable definition context matz (Yukihiro Matsumoto) 09/05/2019 10:52 PM Actions
15372 Ruby master Bug Open openssl 1.1.1a on Debian sid test failures rhenium (Kazuki Yamaguchi) 12/03/2018 11:48 AM Actions
12582 Ruby master Bug Assigned OpenSSL Authenticated Encryption should check for tag length rhenium (Kazuki Yamaguchi) 04/28/2017 01:45 PM Actions
13100 Ruby master Bug Assigned OpenSSL::PKey::EC#public_keyでGroup情報がコピーされない。 openssl 01/08/2017 05:51 AM Actions
15729 Ruby master Bug Open OpenSSL::SSL::SSLSocket#connect randomly hangs ko1 (Koichi Sasada) 04/02/2019 03:01 AM Actions
15882 Ruby master Bug Open OpenSSL::X509::Name.parse usage rhenium (Kazuki Yamaguchi) 06/04/2019 12:54 AM Actions
15409 Ruby master Bug Assigned OpenStruct error when attribute is called 'method' marcandre (Marc-Andre Lafortune) 05/09/2019 03:15 PM Actions
15433 Ruby master Bug Open OpenStruct NameError vs NoMethodError spec fails for method_missing 12/18/2018 06:25 PM Actions
12136 Ruby master Bug Open OpenStruct.new(format: :bar).send :format # => too few arguments 04/06/2016 06:26 PM Actions
10388 Ruby master Bug Open Operator precedence problem in multiple assignment (massign) matz (Yukihiro Matsumoto) 08/20/2019 08:33 PM Actions
11523 Ruby master Bug Assigned optparse short options will match complete options nobu (Nobuyoshi Nakada) 07/01/2019 10:24 PM Actions
10542 Ruby master Bug Open out-of-place build from repository builds enc/trans/*.c in the source directory and the build directory 11/25/2014 10:15 PM Actions
13932 Ruby master Bug Open [PATCH] Extension libraries take precedence in checks of later Kernel.#require calls for features without file extensions 09/23/2017 04:48 PM Actions
4352 Ruby master Bug Open [patch] Fix eval(s, b) backtrace; make eval(s, b) consistent with eval(s) matz (Yukihiro Matsumoto) 08/12/2019 11:06 PM Actions
15386 Ruby master Bug Open [PATCH] io.c (rb_io_check_char_readable): do not io_fflush buffered sockets 12/06/2018 11:38 AM Actions
11304 Ruby master Bug Open [PATCH] Kernel.global_variables should observe $~. matz (Yukihiro Matsumoto) 07/30/2019 03:50 AM Actions
15313 Ruby master Bug Open [PATCH] Let debuggers know when a tail call happens ko1 (Koichi Sasada) 12/05/2018 07:05 AM Actions
10855 Ruby master Bug Open [PATCH] Matrix#inverse returns matrix of integers whenever possible marcandre (Marc-Andre Lafortune) 02/23/2015 04:38 PM Actions
9121 Ruby master Bug Assigned [PATCH] Remove rbtree implementation of SortedSet due to performance regression knu (Akinori MUSHA) 01/21/2014 05:07 PM Actions
15310 Ruby master Bug Open [PATCH] thread_pthread.c: close race from UBF_TIMER and non-GVL-releasing thread 11/20/2018 12:50 AM Actions
15263 Ruby master Bug Open [PATCH] vm_trace.c (postponed_job_register): only hit main thread ko1 (Koichi Sasada) 10/27/2018 11:35 PM Actions
15417 Ruby master Bug Open Pathname case insensitive comparison 12/15/2018 04:35 AM Actions
14891 Ruby master Bug Open Pathname#join has different behaviour to File.join 07/13/2018 04:58 AM Actions
10650 Ruby master Bug Open [PERF] bm_hash_keys and bm_hash_values nobu (Nobuyoshi Nakada) 12/26/2014 09:55 AM Actions
7968 Ruby master Bug Assigned Poor UDPSocket#send performance in ruby 2.0.0 on windows cruby-windows 10/23/2017 12:23 AM Actions
10248 Ruby master Bug Open Possible missing test or bug for Module#include and Module#prepend 12/25/2017 06:15 PM Actions
10749 Ruby master Bug Open Possible overflow in GC::Profiler report on 2.2.0 01/16/2015 09:27 PM Actions
12834 Ruby master Bug Open `prepend` getting prepended even if it already exists in the ancestors chain 11/30/2017 12:53 AM Actions
13920 Ruby master Bug Open prepping io for stdin returns "access denied" on windows 09/20/2017 07:49 AM Actions
13144 Ruby master Bug Open prettyprint doesn't detect cycles when wrapped inside Delegators 01/22/2017 01:57 AM Actions
10167 Ruby master Bug Open Prime#include?(mod) hangs up yugui (Yuki Sonoda) 08/11/2019 08:26 PM Actions
16007 Ruby master Bug Assigned Process.clock_getres matches the clock in practice for Process::CLOCK_{PROCESS,THREAD}_CPUTIME_ID FAILED fails on armv7hl Eregon (Benoit Daloze) 09/22/2019 05:00 PM Actions
12597 Ruby master Bug Open Produce test failure if some tests cannot be executed due to lacking data nobu (Nobuyoshi Nakada) 07/19/2016 01:49 AM Actions
14096 Ruby master Bug Assigned Psych allows invalid single quote escape character hsbt (Hiroshi SHIBATA) 07/26/2018 11:07 AM Actions
10637 Ruby master Bug Open Puppet orchestration on vagrant fails with Error: Non-HTTP proxy URI 12/23/2014 06:59 PM Actions
15737 Ruby master Bug Open Queue#pop randomly hangs forever ko1 (Koichi Sasada) 04/02/2019 03:01 AM Actions
10128 Ruby master Bug Open Quoting problem for arguments of Kernel.system, Kernel.exec on Windows cruby-windows 08/12/2014 04:18 PM Actions
8790 Ruby master Bug Feedback r41424 以降、Solaris と gdbm 1.1.10 にて TestGDBM#test_s_open_lock が終わらない nobu (Nobuyoshi Nakada) 08/12/2014 04:08 AM Actions
15209 Ruby master Bug Open r64925 order-only-prerequisites - make targets - breaking change 10/06/2018 03:51 PM Actions
13891 Ruby master Bug Open Rake - no files in bin folder - 59839 09/12/2017 03:47 AM Actions
14271 Ruby master Bug Open Random TestIO_Console#test_oflush failure 01/02/2018 02:09 PM Actions
10466 Ruby master Bug Assigned rb_eval_string_wrap does not actually wrap in a module binding ko1 (Koichi Sasada) 07/30/2019 07:54 AM Actions
15570 Ruby master Bug Open rb_int2big signature change #14036 breaks VIM on 32b arches 01/30/2019 09:21 AM Actions
10959 Ruby master Bug Open rb_iseq_load: problems with hash containing symbolic keys ko1 (Koichi Sasada) 03/10/2015 03:45 PM Actions
9287 Ruby master Bug Feedback 'rb_obj_write' discards qualifiers from pointer target type ko1 (Koichi Sasada) 08/21/2015 11:41 PM Actions
12258 Ruby master Bug Assigned RDoc bug when handling comments in C code examples aycabta (aycabta .) 11/06/2018 04:53 PM Actions
9242 Ruby master Bug Assigned Rdoc detection of aliases drbrain (Eric Hodel) 09/11/2019 12:03 AM Actions
7859 Ruby master Bug Assigned Readline: Incorrect arrow key behavior in vi_editing_mode insert mode with Readline 6.2 kouji (Kouji Takao) 12/25/2017 06:15 PM Actions
11778 Ruby master Bug Open recv_io with mode breaks when klass arg is kind of BasicSocket 12/07/2015 06:50 AM Actions
11194 Ruby master Bug Open Refactor env-sourced proxy logic for uri/generic 05/28/2015 10:24 PM Actions
15428 Ruby master Bug Open Refactor Proc#>> and #<< 01/20/2019 08:04 PM Actions
14083 Ruby master Bug Open Refinement in block calling incorrect method 11/05/2017 07:36 PM Actions
16242 Ruby master Bug Open Refinements method call to failed 10/13/2019 12:00 AM Actions
14744 Ruby master Bug Open Refinements modules have a superclass matz (Yukihiro Matsumoto) 05/09/2018 09:09 AM Actions
11704 Ruby master Bug Assigned Refinements only get "used" once in loop matz (Yukihiro Matsumoto) 04/14/2016 02:45 AM Actions
9580 Ruby master Bug Open Refinements regression in IRB 05/18/2016 11:52 PM Actions
13446 Ruby master Bug Assigned refinements with prepend for module has strange behavior nobu (Nobuyoshi Nakada) 10/12/2019 11:51 PM Actions
11182 Ruby master Bug Feedback Refinement with alias causes strange behavior ko1 (Koichi Sasada) 11/05/2016 03:13 AM Actions
14671 Ruby master Bug Open Refining Module#refine itself introduces strange state 04/10/2018 06:27 AM Actions
14103 Ruby master Bug Open Regexp absense operator has no chance to ^C 11/13/2017 11:15 AM Actions
14838 Ruby master Bug Open RegexpError with double "s" in look-behind assertion in case-insensitive unicode regexp 06/09/2018 04:04 PM Actions
14364 Ruby master Bug Open Regexp last match variable in procs 09/14/2018 05:28 AM Actions
16145 Ruby master Bug Open regexp match error if mixing /i, character classes, and utf8 09/06/2019 05:52 AM Actions
8444 Ruby master Bug Open Regexp vars $~ and friends are not thread local ko1 (Koichi Sasada) 07/30/2019 07:38 AM Actions
13671 Ruby master Bug Open Regexp with lookbehind and case-insensitivity raises RegexpError only on strings with certain characters 08/29/2018 10:20 AM Actions
15674 Ruby master Bug Open Regression: ObjectSpace.allocation_sourceline produces the wrong location for allocations, it shows the end of the method instead of the line where the object was created 03/18/2019 03:49 PM Actions
12862 Ruby master Bug Open Regular Expression Named Group Matching does not work with #{} (Similar? to issue #2778) 10/23/2016 11:22 AM Actions
12547 Ruby master Bug Assigned Remove ONIG_UNICODE_VERSION_... in enc/unicode/case-folding.rb, casefold.h nobu (Nobuyoshi Nakada) 04/28/2017 01:45 PM Actions
6124 Ruby master Bug Assigned remove the "spec-only gems" in Ruby 1.9.3 (was What is the purpose of "fake" gems in Ruby) hsbt (Hiroshi SHIBATA) 11/06/2018 04:58 PM Actions
15982 Ruby master Bug Assigned Remove y2racc and racc2y hsbt (Hiroshi SHIBATA) 08/19/2019 04:24 PM Actions
15993 Ruby master Bug Open 'require' doesn't work if there are Cyrillic chars in the path to Ruby dir 08/01/2019 08:25 PM Actions
10902 Ruby master Bug Open require("enumerator") scans LOAD_PATH 2x on every invocation 07/16/2015 07:44 AM Actions
15422 Ruby master Bug Open Re: [ruby-cvs:73514] normal:r66413 (trunk): thread_pthread.c: fix memory leak from fork loop leapfrog (v3) 12/16/2018 02:13 PM Actions
13513 Ruby master Bug Assigned Resolv::DNS::Message.decode hangs after detecting truncation in UDP messages akr (Akira Tanaka) 07/15/2017 11:25 AM Actions
9572 Ruby master Bug Open Restarting Coverage does not produce correct coverage result 03/11/2018 09:03 PM Actions
8484 Ruby master Bug Assigned Restoring conditions through the ruby method call during VM processing ko1 (Koichi Sasada) 01/05/2018 09:00 PM Actions
14004 Ruby master Bug Open ri confused by method aliases and by Queue versus Thread::Queue 10/12/2017 10:30 PM Actions
13864 Ruby master Bug Assigned Rinda multicast test failures due to missing default route seki (Masatoshi Seki) 09/07/2017 07:10 AM Actions
8203 Ruby master Bug Assigned Rinda: recycled object seki (Masatoshi Seki) 04/12/2013 11:21 AM Actions
16008 Ruby master Bug Open Ripper hshptn node drops information nobu (Nobuyoshi Nakada) 10/09/2019 08:21 AM Actions
14046 Ruby master Bug Open Ripper loses DATA 10/24/2017 08:15 AM Actions
13980 Ruby master Bug Feedback Rounding failure on i686 (i386). 08/25/2019 08:20 PM Actions
12548 Ruby master Bug Open Rounding modes inconsistency between round versus sprintf 04/13/2019 12:46 AM Actions
9507 Ruby master Bug Open Ruby 2.1.0 is broken on ARMv5: tried to create Proc object without a block charliesome (Charlie Somerville) 01/05/2018 09:00 PM Actions
14387 Ruby master Bug Open Ruby 2.5 を Alpine Linux で実行すると比較的浅めで SystemStackError 例外になる 06/11/2018 01:44 PM Actions
14418 Ruby master Bug Open ruby 2.5 slow regexp execution 01/30/2018 07:32 AM Actions
16116 Ruby master Bug Open ruby2.6.3(x86/x64) use win32ole could not new Object, return 0x80070057 08/22/2019 12:01 PM Actions
16179 Ruby master Bug Feedback ruby binaries generate "already initialized constant" warnings on AIX 6.1 10/15/2019 02:47 PM Actions
10436 Ruby master Bug Open ruby -c and ripper inconsistency: m(&nil) {} 08/27/2019 12:08 AM Actions
14422 Ruby master Bug Open Ruby configuration options should not be reused for gem builds 03/05/2018 03:32 PM Actions
15273 Ruby master Bug Feedback Ruby crashing after updating Mac OS to Mojave (10.14) 08/28/2019 01:16 AM Actions
11269 Ruby master Bug Assigned ruby_init_setproctitle() should be called before require_libraries() kosaki (Motohiro KOSAKI) 06/17/2015 03:01 AM Actions
14596 Ruby master Bug Open Ruby master is broken with bootsnap 03/23/2018 06:21 AM Actions
7758 Ruby master Bug Assigned Ruby on Windows crashes when active codepage is codepage 65001 and outputting unicode character nobu (Nobuyoshi Nakada) 10/30/2015 12:37 PM Actions
11335 Ruby master Bug Open `ruby -r debug` catchpoint problem 12/07/2018 08:32 AM Actions
5317 Ruby master Bug Assigned rubyのヘッダファイルを使った拡張を行う際にoff_tの宣言回避をする事が出来ない。 nobu (Nobuyoshi Nakada) 01/05/2018 09:00 PM Actions
14353 Ruby master Bug Open $SAFE should stay at least thread-local for compatibility matz (Yukihiro Matsumoto) 02/07/2019 05:23 AM Actions
13571 Ruby master Bug Open Script arguments, encoding, windows / MinGW 11/12/2017 10:53 PM Actions
8446 Ruby master Bug Open sdbm fails to fetch existing key if many elements in it 07/13/2019 10:28 PM Actions
14716 Ruby master Bug Open SecureRandom throwing an error in Ruby 2.5.1 09/22/2019 04:38 PM Actions
15179 Ruby master Bug Feedback Segfault caused by only 'loop{ x<<[] }' 10/01/2018 01:33 PM Actions
5334 Ruby master Bug Assigned Segmentation fault in InternetExplorer IServiceProvider interface suke (Masaki Suketa) 04/24/2012 10:47 AM Actions
14678 Ruby master Bug Feedback Segmentation fault in pg 10/28/2018 02:50 PM Actions
14874 Ruby master Bug Open Segmentation fault under Cygwin 06/27/2018 02:33 PM Actions
12444 Ruby master Bug Assigned Segmentation fault when running TestException#test_machine_stackoverflow on cygwin nobu (Nobuyoshi Nakada) 04/28/2017 01:45 PM Actions
14327 Ruby master Bug Open Segmentation fault while compiling ruby 2.5 on alpine armhf 01/07/2018 04:06 PM Actions
6391 Ruby master Bug Assigned Segment Fault while execute make_encmake.rb for Ruby 1.9.3 P194 ( MinGW64) nobu (Nobuyoshi Nakada) 01/26/2013 06:55 AM Actions
11668 Ruby master Bug Open SEGV instead of SystemStackError when using the TracePoint API 11/09/2015 04:38 AM Actions
14049 Ruby master Bug Open SEGV svn 60401 require_relative 10/26/2017 05:25 PM Actions
14266 Ruby master Bug Open Set#clone(freeze: false) makes frozen internal hash knu (Akinori MUSHA) 01/06/2018 05:29 AM Actions
14325 Ruby master Bug Assigned Set#reset raise RuntimeError instead of FrozenError knu (Akinori MUSHA) 01/06/2018 03:32 PM Actions
11230 Ruby master Bug Open Should rb_struct_s_members() be public API? 06/06/2015 08:06 PM Actions
13675 Ruby master Bug Open Should Zlib::GzipReader#ungetc accept nil? 08/25/2019 06:28 PM Actions
13768 Ruby master Bug Open SIGCHLD and Thread dead-lock problem 07/27/2017 06:08 AM Actions
15944 Ruby master Bug Open Simultaneous line feeding and scrolling doesn't work well with irb on tmux aycabta (aycabta .) 06/20/2019 04:58 AM Actions
14963 Ruby master Bug Open Since r64107, on Solaris, spec test of rb_io_wait_readable hangs up 08/03/2018 02:49 PM Actions
8855 Ruby master Bug Assigned {Single}Forwardable#def_delegators が、Stringでメソッド名を渡された時だけ __id__ と __send__ が取り除かれる keiju (Keiju Ishitsuka) 08/15/2019 10:25 PM Actions
11064 Ruby master Bug Open #singleton_methods for objects with special singleton_class returns an empty array 04/12/2015 08:35 PM Actions
8744 Ruby master Bug Open SIZEOF_UNSIGNED___INT128 08/06/2013 11:59 PM Actions
14474 Ruby master Bug Open skip "TestException#test_thread_signal_location" as known bug 12/10/2018 07:09 AM Actions
10613 Ruby master Bug Assigned SNI is not optional when using TLS naruse (Yui NARUSE) 12/17/2016 05:26 PM Actions
14997 Ruby master Bug Open Socket connect timeout exceeds the timeout value for 07/02/2019 10:58 AM Actions
15268 Ruby master Bug Open Solarisでtest/drb/test_drbssl.rbが落ちる openssl 11/06/2018 03:48 PM Actions
14743 Ruby master Bug Open Some links broken in README 05/09/2018 05:41 AM Actions
5418 Ruby master Bug Assigned Some properties of WEBrick::HTTPRequest could be malformed normalperson (Eric Wong) 08/09/2018 08:56 AM Actions
16177 Ruby master Bug Open Some `*.rb` files on builddir cause Segmentation fault 09/24/2019 10:05 AM Actions
15795 Ruby master Bug Open Some test fails on Haiku 04/26/2019 01:28 PM Actions
12564 Ruby master Bug Open Sometimes test_settracefunc.rb segfaults in exec_hooks_body (vm_trace.c) 07/15/2016 04:40 AM Actions
11063 Ruby master Bug Open Special singleton class should return true for singleton_class? test 04/12/2015 07:50 PM Actions
14737 Ruby master Bug Assigned Split default gems into separate directory structure hsbt (Hiroshi SHIBATA) 09/11/2019 02:48 PM Actions
14662 Ruby master Bug Open Stack consistency error in 2.5.1 04/20/2018 01:40 PM Actions
16158 Ruby master Bug Open "st" Character Sequence In Regex Look-Behind Causes Illegal Pattern Error When Combined With POSIX Bracket Expressions And Case Insensitivity Flag 09/17/2019 09:37 AM Actions
14679 Ruby master Bug Assigned StdLib gems should properly specify their dependencies hsbt (Hiroshi SHIBATA) 04/11/2018 01:14 PM Actions
16121 Ruby master Bug Open Stop making a redundant hash copy in Hash#dup ko1 (Koichi Sasada) 09/27/2019 10:49 PM Actions
15425 Ruby master Bug Open Store MJIT header into Ruby versioned directory. 01/03/2019 03:38 PM Actions
16190 Ruby master Bug Feedback Strange Crash 09/30/2019 06:54 PM Actions
15790 Ruby master Bug Open Strange interaction between autoload and $LOADED_FEATURES 04/24/2019 07:57 PM Actions
11526 Ruby master Bug Assigned Streaming HTTP requests are not idempotent and should not be retried naruse (Yui NARUSE) 07/01/2019 09:16 PM Actions
9414 Ruby master Bug Feedback strftime returns incorrectly encoded string nobu (Nobuyoshi Nakada) 01/05/2018 09:00 PM Actions
12052 Ruby master Bug Assigned String#encode with xml option returns wrong result akr (Akira Tanaka) 02/05/2016 02:50 AM Actions
9016 Ruby master Bug Feedback String#encoding is lying? cruby-windows 10/15/2013 08:35 AM Actions
11014 Ruby master Bug Assigned String#partition doesn't return correct result on zero-width match matz (Yukihiro Matsumoto) 04/18/2015 05:09 PM Actions
13663 Ruby master Bug Open `String#upto` doesn't work as expected 06/23/2017 11:47 AM Actions
10584 Ruby master Bug Open String.valid_encoding?, String.ascii_only? fails to account for BOM. 01/05/2018 09:01 PM Actions
12416 Ruby master Bug Open struct rb_id_table lacks mark function 05/23/2016 10:32 AM Actions
10845 Ruby master Bug Open Subclassing String matz (Yukihiro Matsumoto) 06/02/2015 07:38 PM Actions
11636 Ruby master Bug Assigned super in instance_eval in a method defined in a module is invoked with a wrong receiver ko1 (Koichi Sasada) 09/19/2019 07:38 AM Actions
15629 Ruby master Bug Open super_method fails on binded/unbinded/cloned methods 10/02/2019 10:24 PM Actions
13257 Ruby master Bug Feedback Symbol#singleton_class should be undef 04/17/2017 06:30 AM Actions
15621 Ruby master Bug Open system({}, ...) breaks nonascii ENV["PATH"] on Windows 02/25/2019 08:51 AM Actions
7742 Ruby master Bug Open System encoding (Windows-1258) is not recognized by Ruby to convert back to UTF-8 duerst (Martin Dürst) 12/25/2017 06:15 PM Actions
4040 Ruby master Bug Assigned SystemStackError with Hash[*a] for Large _a_ ko1 (Koichi Sasada) 12/25/2017 06:14 PM Actions
14681 Ruby master Bug Open `syswrite': stream closed in another thread (IOError) 04/22/2018 12:12 AM Actions
16161 Ruby master Bug Open tailcall_optimization may be disabled after r67315 ko1 (Koichi Sasada) 10/06/2019 09:20 AM Actions
10203 Ruby master Bug Feedback TCPServer.new has strange behaviour when EADDRINUSE without specifying hostname 10/14/2014 12:15 PM Actions
13876 Ruby master Bug Open Tempfile's finalizer can be interrupted by a Timeout exception which can cause the process to hang 09/12/2017 01:27 AM Actions
14064 Ruby master Bug Open test-all with and without -j - incorrect assertions and missing test methods 11/03/2017 10:54 PM Actions
12442 Ruby master Bug Assigned TestArgf#test_textmode fails on cygwin nobu (Nobuyoshi Nakada) 04/28/2017 01:45 PM Actions
16033 Ruby master Bug Open test_callinfo_unreachable_path Bus Error on Solaris sparc 08/01/2019 01:58 PM Actions
12473 Ruby master Bug Assigned Test failure on fedora with TestTimeExtension#test_huge_precision nobu (Nobuyoshi Nakada) 04/28/2017 01:45 PM Actions
12540 Ruby master Bug Open test failures when SHARABLE_MIDDLE_SUBSTRING=1 07/02/2016 06:23 AM Actions
14090 Ruby master Bug Open `TestGc#test_interrupt_in_finalizer` fails very rarely kosaki (Motohiro KOSAKI) 12/19/2017 06:36 AM Actions
12445 Ruby master Bug Assigned Testing TestIO#test_open_fifo_does_not_block_other_threads results in deadlock on cygwin nobu (Nobuyoshi Nakada) 04/28/2017 01:45 PM Actions
16030 Ruby master Bug Open test_memsize fails on x32 ABI: Unsupported RVALUE_SIZE=24 07/31/2019 07:29 AM Actions
12500 Ruby master Bug Open TestProcess#test_aspawn_too_long_path fails on mips with "argument too big" 06/17/2016 05:56 PM Actions
10580 Ruby master Bug Open TestProcess#test_deadlock_by_signal_at_forking fails on ARM akr (Akira Tanaka) 12/08/2014 04:24 PM Actions
4173 Ruby master Bug Open TestProcess#test_wait_and_sigchild が、たまに失敗する 03/15/2018 08:29 AM Actions
14727 Ruby master Bug Assigned TestQueue#test_queue_with_trap always timeout on Windows10 ko1 (Koichi Sasada) 05/01/2018 02:59 AM Actions
13269 Ruby master Bug Assigned test/readline/test_readline.rb and mingw nobu (Nobuyoshi Nakada) 03/13/2017 08:56 AM Actions
15569 Ruby master Bug Open TestResolvDNS#test_no_server always fails on usa's mswin environment ko1 (Koichi Sasada) 04/02/2019 03:01 AM Actions
14175 Ruby master Bug Open TestResolvMDNS#test_mdns_each_address fails 12/13/2017 04:16 PM Actions
13758 Ruby master Bug Feedback TestRubyOptions#test_segv_setproctitle segfaults on AARCH64 11/29/2018 02:14 PM Actions
15465 Ruby master Bug Feedback Tests failed on i386-cygwin 01/09/2019 07:55 AM Actions
5577 Ruby master Bug Assigned test/testunit/test_parallel.rb causes NoMethodError when file descriptor is limited to 30. sorah (Sorah Fukumori) 03/11/2012 06:53 PM Actions
14761 Ruby master Bug Open TestThread#test_join_limits hangs up on Solaris 10 with gcc 05/16/2018 05:23 AM Actions
15551 Ruby master Bug Open The behavior of FIX2INT and FIX2UINT differs by platform 07/30/2019 08:55 PM Actions
12594 Ruby master Bug Assigned The class does not inherit from a module the modules that were included after the inclusion nobu (Nobuyoshi Nakada) 10/11/2016 10:51 AM Actions
12159 Ruby master Bug Assigned Thread::Backtrace::Location#path returns absolute path for files loaded by require_relative ko1 (Koichi Sasada) 05/30/2017 09:58 AM Actions
15072 Ruby master Bug Open thread.c:4356:5: error: implicit declaration of function ‘ubf_list_atfork’ normalperson (Eric Wong) 09/20/2018 03:32 AM Actions
8185 Ruby master Bug Open Thread/fork issue 04/07/2013 11:53 PM Actions
15735 Ruby master Bug Open Thread#handle_interrupt does not prevent Thread#kill from interrupting 03/28/2019 10:42 PM Actions
12689 Ruby master Bug Open Thread isolation of $~ and $_ 12/02/2017 09:37 PM Actions
13688 Ruby master Bug Open Thread overflow hangs ruby (not responding ^C) 08/25/2019 07:17 PM Actions
15507 Ruby master Bug Open Thread#raise is delivered to GC context 01/05/2019 06:13 PM Actions
15438 Ruby master Bug Open Threads can't switch faster than TIME_QUANTUM_(NSEC|USEC|MSEC) 03/25/2019 08:53 PM Actions
11174 Ruby master Bug Open threads memory leak ko1 (Koichi Sasada) 06/17/2019 03:17 PM Actions
15644 Ruby master Bug Open ThreadsWait problems with Thread#report_on_exception 03/13/2019 12:04 PM Actions
15587 Ruby master Bug Open Thread tests failing 03/23/2019 10:06 AM Actions
14241 Ruby master Bug Assigned Time.strptime() doesn't support the directive "%W". akr (Akira Tanaka) 08/11/2019 07:32 PM Actions
7976 Ruby master Bug Assigned TracePoint call is at call point, not call site ko1 (Koichi Sasada) 01/05/2018 09:00 PM Actions
9959 Ruby master Bug Assigned TracePoint can invoke inconsistent call event with bmethod ko1 (Koichi Sasada) 01/05/2018 09:00 PM Actions
10470 Ruby master Bug Assigned TracePoint cannot trace attr_accessor/reader/writer method ko1 (Koichi Sasada) 08/21/2015 03:47 PM Actions
13392 Ruby master Bug Open TracePoint doesn't work correct with monkey patches / aliased methods 03/31/2017 08:39 PM Actions
14889 Ruby master Bug Open TracePoint for :line never seems to trigger on argument list. Maybe by design? 07/01/2018 03:59 PM Actions
14817 Ruby master Bug Assigned TracePoint#parameters for bmethod's return event should return the same value as its Method#parameters ko1 (Koichi Sasada) 07/15/2019 02:51 AM Actions
15634 Ruby master Bug Open TracePoint seems to be skipping some methods. 03/05/2019 07:35 PM Actions
6351 Ruby master Bug Assigned transcode table generator does not support multi characters of Unicode duerst (Martin Dürst) 12/25/2017 06:15 PM Actions
6117 Ruby master Bug Feedback Transfers allowed into Fibers that have resumed into other fibers ko1 (Koichi Sasada) 01/31/2017 09:23 AM Actions
12725 Ruby master Bug Assigned Trying to use ./miniruby before it exists nobu (Nobuyoshi Nakada) 04/28/2017 01:45 PM Actions
15655 Ruby master Bug Open Unable to handle Russian dirname on Windows 03/11/2019 10:08 AM Actions
14582 Ruby master Bug Open Unable to use `method__entry` and `method_return` tracing probes since 2.5 06/05/2018 03:42 AM Actions
14176 Ruby master Bug Open Unclear error message when calling method with keyword arguments 12/13/2017 06:34 PM Actions
9930 Ruby master Bug Open unicode filenames somehow don't work cruby-windows 01/05/2018 09:00 PM Actions
9806 Ruby master Bug Open URI#encode doesn't encode characters '[' and ']'. They should be encoded as %5B and %5D respectively. 08/05/2014 06:50 PM Actions
12235 Ruby master Bug Open URI.encode issue with square brackets 03/29/2017 09:13 AM Actions
15276 Ruby master Bug Open URI.join behaviour is unintuitive 11/02/2018 03:25 AM Actions
12852 Ruby master Bug Open URI.parse can't handle non-ascii URIs akira (akira yamada) 12/12/2016 06:39 PM Actions
9045 Ruby master Bug Assigned URIに含まれるエンコードされたID/パスワードがデコードされない akira (akira yamada) 10/24/2013 11:33 AM Actions
10250 Ruby master Bug Open User-Agent HTTP header not being set on CONNECT requests 09/17/2014 06:16 PM Actions
14240 Ruby master Bug Open warn four special variables: $; $, $/ $\ 08/26/2019 04:33 AM Actions
7840 Ruby master Bug Open -Wdeclaration-after-statement is valid for C/ObjC but not for C++ nobu (Nobuyoshi Nakada) 12/25/2017 06:15 PM Actions
15262 Ruby master Bug Feedback WeakRef::RefError for object that is still in use 10/31/2018 10:07 AM Actions
9986 Ruby master Bug Assigned WEBrick content-length being set when transfer-encoding is chunked nahi (Hiroshi Nakamura) 08/11/2019 08:01 PM Actions
15608 Ruby master Bug Open What should be the correct output for Method#inspect with singleton methods? 10/15/2019 02:34 PM Actions
15027 Ruby master Bug Feedback When Struct#each method is overriden Struct#select and Struct#to_a use wrong collections 09/26/2018 10:24 AM Actions
15764 Ruby master Bug Open Whitespace and control characters should not be permitted in tokens matz (Yukihiro Matsumoto) 04/22/2019 07:48 AM Actions
9208 Ruby master Bug Assigned Win32 ANSI color no longer works since revision 43331 nobu (Nobuyoshi Nakada) 12/04/2013 08:42 AM Actions
12987 Ruby master Bug Open Win32 API.rb can not call function without argument. 11/28/2016 12:47 PM Actions
14640 Ruby master Bug Open [win32] File.realpath treats a relative path with a drive letter as an absolute path. cruby-windows 12/10/2018 07:09 AM Actions
12040 Ruby master Bug Assigned [Win32] File.stat fails on a mounted volume cruby-windows 02/01/2016 08:13 AM Actions
5771 Ruby master Bug Assigned WIN32OLERuntimeError using 1.9.2 suke (Masaki Suketa) 03/18/2012 06:46 PM Actions
4405 Ruby master Bug Assigned WIN32OLE & Threads incompatible suke (Masaki Suketa) 06/26/2011 05:52 PM Actions
11410 Ruby master Bug Feedback Win32 Registry enumeration performs unnecessary string re-encoding which cause UndefinedConversionError exceptions 08/13/2015 06:57 AM Actions
12261 Ruby master Bug Open Windows: File.dirname with 2+ / or 2+ \\ will return // or \\\\ 04/07/2016 07:30 PM Actions
15550 Ruby master Bug Assigned Windows - gem bin files - can't run from bash shell hsbt (Hiroshi SHIBATA) 03/20/2019 01:05 AM Actions
14137 Ruby master Bug Open Windows / MinGW - Regexp - Character Properties - General Category 11/29/2017 07:17 AM Actions
12371 Ruby master Bug Assigned Windows Nano Server WIN32OLE compatibility suke (Masaki Suketa) 01/30/2017 10:23 PM Actions
13644 Ruby master Bug Open Windows - Setting Time.now 06/11/2017 03:43 AM Actions
15247 Ruby master Bug Open Windows - TEMP folder, non 8.3 & drive, fails & errors in test-all (ruby & rdoc) 10/23/2018 05:02 PM Actions
16233 Ruby master Bug Open winruby UTF8 Fallback for no CodePage 10/04/2019 11:06 AM Actions
14570 Ruby master Bug Open Wired behavior of File.expand_path() on Windows 03/03/2018 12:13 AM Actions
7964 Ruby master Bug Assigned Writing an ASCII-8BIT String to a StringIO created from a UTF-8 String nobu (Nobuyoshi Nakada) 01/05/2018 09:00 PM Actions
9009 Ruby master Bug Open Wrong binding when tracing c-calls 11/11/2013 12:47 AM Actions
15576 Ruby master Bug Open Wrong error message from some class methods of `Dir` 01/31/2019 01:09 PM Actions
14367 Ruby master Bug Open Wrong interpretation of backslash C in regexp literals 01/17/2018 10:28 AM Actions
14726 Ruby master Bug Open wrong message when superclass is not a Class 05/07/2018 06:39 AM Actions
15178 Ruby master Bug Open Wrong paramaters passing to pthread_setname_np(3) 09/29/2018 03:43 PM Actions
(1-500/1736) Per page: 50, 100, 200, 500

Also available in: Atom CSV PDF