Project

General

Profile

Issues

Filters

Apply Clear

# Project Tracker Status Subject Assignee Updated
2789 Backport186 Bug Open segfault in DL callbacks with mingw32 04/30/2011 10:04 PM Actions
2589 Backport186 Bug Open mkmf.rb bug on "make distclean" if build fails 04/30/2011 10:03 PM Actions
2578 Backport186 Bug Open Requiring a relative path with an empty $LOAD_PATH raises LoadError on 1.8 04/30/2011 10:03 PM Actions
2459 Backport186 Bug Feedback Cannot statically link ext/digest/sha2 04/30/2011 10:03 PM Actions
2434 Backport186 Bug Open Ruby gem update --system /gem install [any_gem_name] ERROR 04/30/2011 10:03 PM Actions
2433 Backport186 Bug Open Ruby gem update --system /gem install [any_gem_name] ERROR 04/30/2011 10:03 PM Actions
2423 Backport186 Bug Open REXML edge case with <a>A &gt; B</a> 04/30/2011 10:03 PM Actions
1978 Backport186 Bug Assigned fixed crash in lib/logger.rb from dependency on svn keywork expansion wyhaines (Kirk Haines) 04/30/2011 10:03 PM Actions
1960 Backport186 Bug Assigned errors in configure on AIX wyhaines (Kirk Haines) 04/30/2011 10:03 PM Actions
1883 Backport186 Bug Open REXML hash sometimes computes a value that is too large 07/22/2011 07:28 AM Actions
1814 Backport186 Bug Open unrecognized option --with-openssl-dir with 1.8.6-p369 (Solaris 10) 04/30/2011 10:03 PM Actions
1696 Backport186 Bug Open http downloads are unuseably slow 04/30/2011 10:03 PM Actions
1557 Backport186 Bug Open Memory leak in DRb 04/30/2011 10:03 PM Actions
3143 Backport187 Bug Open [Ruby 1.8.7] Segmentation fault / stack level too deep 04/30/2011 10:04 PM Actions
3105 Backport187 Bug Open seg faults and bus errors with ruby 1.8.7 p249 04/30/2011 10:04 PM Actions
3100 Backport187 Bug Open Lockup in child after fork 11/23/2011 05:21 PM Actions
3003 Backport187 Bug Open Segfault in vfprintf() using Ruby 1.8.7 p249 04/30/2011 10:04 PM Actions
2575 Backport187 Bug Open a test fail for IO#readpartial is broken on *BSD 04/30/2011 10:03 PM Actions
2493 Backport187 Bug Assigned double free bug nobu (Nobuyoshi Nakada) 04/30/2011 10:03 PM Actions
2483 Backport187 Bug Feedback String#to_f of small numbers hangs 04/30/2011 10:03 PM Actions
2378 Backport187 Bug Open Regression in ParseDate.parsedate('nn-nn') 04/30/2011 10:03 PM Actions
1752 Backport187 Bug Open Segfault in gdbm - 1.8.7 p160 and up 04/30/2011 10:03 PM Actions
1746 Backport187 Bug Open LDSHARED set to 'ld -G' on Solaris doesn't work with Sun studio 04/30/2011 10:03 PM Actions
1639 Backport187 Bug Open YAML.load fails on some Regexps 04/30/2011 10:03 PM Actions
1428 Backport187 Bug Feedback Net/http issue 04/30/2011 10:03 PM Actions
863 Backport187 Bug Assigned Openssl issues with fresh compile on Ubuntu matz (Yukihiro Matsumoto) 04/30/2011 10:03 PM Actions
3705 Backport191 Bug Open YAML segmentation fault 04/30/2011 10:04 PM Actions
3603 Backport191 Bug Assigned RubyGems default gem directory is wrong when used with ruby 1.9.1 with --program-suffix=1.9. nobu (Nobuyoshi Nakada) 04/30/2011 10:04 PM Actions
3578 Backport191 Bug Open Segmentation fault in threaded program 04/30/2011 10:04 PM Actions
3561 Backport191 Bug Open ruby-1.9.3-r28570 test/unit gem activation failure 04/30/2011 10:04 PM Actions
3528 Backport191 Bug Open "make" aborts - ruby-1.9.1-p429 04/30/2011 10:04 PM Actions
3438 Backport191 Bug Open ruby-1.9.1-p378 'make test' failed at test_thread.rb 04/30/2011 10:04 PM Actions
3431 Backport191 Bug Open Segmentation fault in ruby-1.9.1-p378 10/23/2012 03:04 PM Actions
3373 Backport191 Bug Feedback Segmentation fault when trying access project via Mozilla Firefox. 04/30/2011 10:04 PM Actions
3349 Backport191 Bug Feedback [BUG] cfp consistency error - send 04/30/2011 10:04 PM Actions
3293 Backport191 Bug Open fails to build with gcc 4.4.3 04/30/2011 10:04 PM Actions
3292 Backport191 Bug Open Fail 2 IO tests during make test for ruby-1.9.1-p376 with Cygwin 04/30/2011 10:04 PM Actions
3276 Backport191 Bug Open webrick/server.rb:90: [BUG] Segmentation fault 04/30/2011 10:04 PM Actions
3243 Backport191 Bug Open Can't build Ruby after r26506 04/30/2011 10:04 PM Actions
3215 Backport191 Bug Feedback Windows: IO.popen returns "handle is invalid" 04/30/2011 10:04 PM Actions
3201 Backport191 Bug Open Backport request for r25932 to 1.9.1 branch (gem_prelude.rb) 04/30/2011 10:04 PM Actions
3193 Backport191 Bug Open uint is not parsed in dl/cparser.rb 04/30/2011 10:04 PM Actions
3190 Backport191 Bug Open Segmentation fault gzip/tar 04/30/2011 10:04 PM Actions
3189 Backport191 Bug Open [BUG] Segmentation fault 04/30/2011 10:04 PM Actions
3188 Backport191 Bug Open remove_method.rb:3: [BUG] Segmentation fault 04/30/2011 10:04 PM Actions
3178 Backport191 Bug Open Fileutils#rmdir does rescue Dir Errors without raising new 01/03/2014 05:50 PM Actions
3174 Backport191 Bug Feedback segmentation fault at running Array method each 04/30/2011 10:04 PM Actions
3138 Backport191 Bug Open Segmentation fault 04/30/2011 10:04 PM Actions
3057 Backport191 Bug Feedback Segmentation fault: object allocation during garbage collection phase 04/30/2011 10:04 PM Actions
2780 Backport191 Bug Open "Handle is invalid" when accessing the file system from different threads (win32) 04/30/2011 10:04 PM Actions
2718 Backport191 Bug Assigned DRb mixing up function return values between PIDs after fork() seki (Masatoshi Seki) 04/30/2011 10:04 PM Actions
2714 Backport191 Bug Assigned Interpreter deadlock when using ::Socket.pair nobu (Nobuyoshi Nakada) 04/30/2011 10:04 PM Actions
2701 Backport191 Bug Open rubyspec: BigDecimal#div returns NaN if divided by zero and no precision given ERROR 04/30/2011 10:04 PM Actions
2638 Backport191 Bug Assigned ruby-1.9.1-p37[68] build on aix5.3 with gcc-4.2 failed to run for me because it ignores where libgcc is located. kanemoto (Yutaka Kanemoto) 04/30/2011 10:03 PM Actions
2630 Backport191 Bug Open generator.rb missing from 1.9.1 standard library? 04/30/2011 10:03 PM Actions
2596 Backport191 Bug Open Openssl Segmentation Faults on Red Hat Enterprise Linux 5.3 04/30/2011 10:03 PM Actions
2570 Backport191 Bug Open ruby never stops executing when installing fxruby-1.6.20-x86-mingw32.gem 04/30/2011 10:03 PM Actions
2391 Backport191 Bug Assigned in CentOS after some times Ruby 1.9.1 get "segmentation fault" nobu (Nobuyoshi Nakada) 04/30/2011 10:03 PM Actions
2383 Backport191 Bug Open windows - calling FreeEnvironmentStrings on envarea invalidates memory in use 04/30/2011 10:03 PM Actions
2358 Backport191 Bug Assigned Segmentation fault using dl/import nobu (Nobuyoshi Nakada) 04/30/2011 10:03 PM Actions
2339 Backport191 Bug Assigned DRb leaves connections half-open seki (Masatoshi Seki) 04/30/2011 10:03 PM Actions
2309 Backport191 Bug Feedback Segfault, repeatable testcase, possibly related to [2295], [2019], [1937]. 04/30/2011 10:03 PM Actions
2295 Backport191 Bug Open segmentation faults 04/30/2011 10:03 PM Actions
2235 Backport191 Bug Assigned Segmentation fault with PTY.spawn nobu (Nobuyoshi Nakada) 04/30/2011 10:03 PM Actions
1937 Backport191 Bug Assigned ruby 1.9.1p243 (2009-07-16 revision 24175) [x86_64-linux] seg.fault nobu (Nobuyoshi Nakada) 04/30/2011 10:03 PM Actions
1907 Backport191 Bug Assigned ssl_timeout cannot be set in HTTPS request yugui (Yuki Sonoda) 04/30/2011 10:03 PM Actions
1856 Backport191 Bug Feedback [BUG] Segmentation fault in 1.9.1p149 04/30/2011 10:03 PM Actions
1767 Backport191 Bug Assigned cgi/session/pstore generating filenames with to less randomness xibbar (Takeyuki FUJIOKA) 04/30/2011 10:03 PM Actions
1653 Backport191 Bug Open YAML load_documents fails on specification example without newline at end 04/30/2011 10:03 PM Actions
1615 Backport191 Bug Feedback 添付ライブラリを使って巨大なCSVファイルを書き出すときにインタープリタがSegmentation Faultを起こす 04/30/2011 10:03 PM Actions
1544 Backport191 Bug Open rb_io_write bug? 04/30/2011 10:03 PM Actions
16009 Ruby master Bug Open Performance regression in 2.7 ko1 (Koichi Sasada) 07/17/2019 11:12 PM Actions
16008 Ruby master Bug Open Ripper hshptn node drops information 07/16/2019 07:42 PM Actions
16007 Ruby master Bug Open Process.clock_getres matches the clock in practice for Process::CLOCK_{PROCESS,THREAD}_CPUTIME_ID FAILED fails on armv7hl 07/16/2019 06:47 AM Actions
16004 Ruby master Bug Open Kernel#lambda captured with Kernel#method doesn't create lambdas 07/15/2019 12:52 PM Actions
16002 Ruby master Bug Feedback File.writable?('/tmp/file') returns true even if it's not writable on Linux 4.19+ 07/14/2019 11:59 PM Actions
16000 Ruby master Bug Open How to avoid the need for updating dependencies manually nobu (Nobuyoshi Nakada) 07/14/2019 10:34 PM Actions
15994 Ruby master Bug Open irb miscalculates nest level when typing do keyword 07/11/2019 06:55 AM Actions
15993 Ruby master Bug Open 'require' doesn't work if there are Cyrillic chars in the path to Ruby dir 07/12/2019 10:15 AM Actions
15989 Ruby master Bug Open irb-1.1.0.pre.1 crashes on using arrow up, home and delete 07/08/2019 09:16 AM Actions
15988 Ruby master Bug Assigned Time#dst? vs "real" timezones nobu (Nobuyoshi Nakada) 07/06/2019 03:56 AM Actions
15984 Ruby master Bug Feedback deleting from a collection while iterating on it 07/04/2019 07:44 PM Actions
15982 Ruby master Bug Assigned Remove y2racc and racc2y hsbt (Hiroshi SHIBATA) 07/09/2019 05:25 AM Actions
15980 Ruby master Bug Assigned Coverage shows while/until after raise if/unless as uncovered line mame (Yusuke Endoh) 07/03/2019 03:48 AM Actions
15979 Ruby master Bug Open URI.parse does not validate components 07/03/2019 12:27 AM Actions
15977 Ruby master Bug Assigned Unobvious result value from #next_rotate_time and #previous_period_end methods of Logger::Period module sonots (Naotoshi Seo) 07/02/2019 03:03 PM Actions
15957 Ruby master Bug Open Splatting nil as **kwargs 06/25/2019 05:07 AM Actions
15956 Ruby master Bug Open `{*nil}` causes confusing error message 06/25/2019 04:55 AM Actions
15944 Ruby master Bug Open Simultaneous line feeding and scrolling doesn't work well with irb on tmux aycabta (aycabta .) 06/20/2019 04:58 AM Actions
15928 Ruby master Bug Open Constant declaration does not conform to JIS 3017:2013 06/16/2019 02:37 PM Actions
15924 Ruby master Bug Open Ripper::Lexer RuntimeError - Ripper FATAL - master/trunk 06/16/2019 01:48 PM Actions
15908 Ruby master Bug Open Detecting BOM with non-UTF encoding 06/08/2019 12:44 PM Actions
15904 Ruby master Bug Feedback Ruby crashes when executing Pronto gem with Rubocop 06/07/2019 10:08 AM Actions
15888 Ruby master Bug Feedback Segmentation fault at 0x000070000afc2450 ruby 2.5.1p57 (2018-03-29 revision 63029) [x86_64-darwin18] 05/31/2019 05:29 AM Actions
15885 Ruby master Bug Open Duplicated `:raise` tracepoint event when exception inside `load` call happens 05/29/2019 10:29 AM Actions
15882 Ruby master Bug Open OpenSSL::X509::Name.parse usage rhenium (Kazuki Yamaguchi) 06/04/2019 12:54 AM Actions
15877 Ruby master Bug Open Incorrect constant lookup result in method on cloned class 05/27/2019 09:01 PM Actions
15876 Ruby master Bug Feedback 1.to_s.encoding != Encoding.default_internal 05/31/2019 08:29 PM Actions
15867 Ruby master Bug Open Enumerable#minmax inconsistent behavior with Time ranges 05/22/2019 09:52 PM Actions
15866 Ruby master Bug Feedback [BUG] Segmentation fault at 0x0000000000000020 06/03/2019 04:18 AM Actions
15856 Ruby master Bug Assigned Idempotent performance of Kernel.require with many activated gems is slow hsbt (Hiroshi SHIBATA) 05/21/2019 09:52 PM Actions
15852 Ruby master Bug Open APPLICATION_VERIFIER_LOCKS_LOCK_IN_FREED_HEAP on exiting ruby 05/15/2019 09:52 PM Actions
15850 Ruby master Bug Open Deprecate and remove optparse/ac 05/15/2019 05:19 AM Actions
15849 Ruby master Bug Open Using hash as first positional argument, mixed with named arguments causes unexpected behavior 05/14/2019 06:51 PM Actions
15835 Ruby master Bug Feedback Path traversal symlink - WEBrick 05/08/2019 03:04 PM Actions
15834 Ruby master Bug Open Mutating the result of SortedSet.to_a mutates the original set, potentially violating the set's guarantees knu (Akinori MUSHA) 05/07/2019 06:56 PM Actions
15830 Ruby master Bug Assigned SortedSet's lazy setup causes unpredictable behaviour in subclass's initialize knu (Akinori MUSHA) 06/05/2019 02:17 AM Actions
15828 Ruby master Bug Open DOTfiles and DOTfolders aren't allowed in $HOME folder on Haiku 05/06/2019 10:42 PM Actions
15827 Ruby master Bug Open Haiku: SSL tests failing 05/05/2019 05:31 PM Actions
15819 Ruby master Bug Open cannot read document of File::NULL with "ri File::NULL" 05/03/2019 09:04 AM Actions
15816 Ruby master Bug Open String#casecmp compares uppercase characters instead of lowercase 05/09/2019 08:01 AM Actions
15812 Ruby master Bug Open Run specs from install folder? 04/30/2019 12:43 PM Actions
15807 Ruby master Bug Open Range#minmax is slow and never returns for endless ranges 06/18/2019 02:08 PM Actions
15796 Ruby master Bug Open Ramdon console crashes 04/26/2019 04:47 PM Actions
15795 Ruby master Bug Open Some test fails on Haiku 04/26/2019 01:28 PM Actions
15790 Ruby master Bug Open Strange interaction between autoload and $LOADED_FEATURES 04/24/2019 07:57 PM Actions
15787 Ruby master Bug Feedback LoadError by EPERM on read-only volume 05/05/2019 03:57 PM Actions
15784 Ruby master Bug Open RUBY_DEBUG=gc_stress dumps core 04/23/2019 09:53 AM Actions
15779 Ruby master Bug Open After NoMemoryError, ruby freezes and takes 100% CPU 05/16/2019 05:07 PM Actions
15767 Ruby master Bug Open .rvm/rubies/ruby-2.4.4/lib/ruby/2.4.0/timeout.rb:86: [BUG] Segmentation fault at 0x000000010ae58a3a 04/15/2019 08:11 AM Actions
15764 Ruby master Bug Open Whitespace and control characters should not be permitted in tokens matz (Yukihiro Matsumoto) 04/22/2019 07:48 AM Actions
15763 Ruby master Bug Open Segmentation fault in timeout.rb / sleep 06/15/2019 01:53 AM Actions
15754 Ruby master Bug Open MinGW build/compile failure with Ruby 2.5.5, but 2.6.2 & trunk ok 04/08/2019 06:11 PM Actions
15753 Ruby master Bug Open unknown keyword when passing an hash to a method that accepts a default argument and a named argument 04/08/2019 02:35 AM Actions
15749 Ruby master Bug Open Rails Sever Crashing 04/05/2019 11:52 AM Actions
15737 Ruby master Bug Open Queue#pop randomly hangs forever ko1 (Koichi Sasada) 04/02/2019 03:01 AM Actions
15735 Ruby master Bug Open Thread#handle_interrupt does not prevent Thread#kill from interrupting 03/28/2019 10:42 PM Actions
15729 Ruby master Bug Open OpenSSL::SSL::SSLSocket#connect randomly hangs ko1 (Koichi Sasada) 04/02/2019 03:01 AM Actions
15728 Ruby master Bug Feedback error compiling C - file under Ruby 04/22/2019 10:32 AM Actions
15727 Ruby master Bug Feedback [BUG] Segmentation fault at 0x0000000000000000 ruby 2.5.3p105 (2018-10-18 revision 65156) [x86_64-linux] 04/23/2019 09:03 AM Actions
15726 Ruby master Bug Open Error compiling Ruby 03/24/2019 06:02 PM Actions
15718 Ruby master Bug Open YAML raises error when dumping strings with UTF32 encoding 03/21/2019 11:33 PM Actions
15717 Ruby master Bug Open Backport #15270 to Ruby 2.5.x 04/24/2019 06:00 AM Actions
15712 Ruby master Bug Feedback DateTime#=== should be defined and compare date and time instead of just the date 03/22/2019 05:36 PM Actions
15675 Ruby master Bug Feedback "fatal - exception reentered" error after installing Ruby 2.5.5 04/23/2019 09:14 AM Actions
15674 Ruby master Bug Open Regression: ObjectSpace.allocation_sourceline produces the wrong location for allocations, it shows the end of the method instead of the line where the object was created 03/18/2019 03:49 PM Actions
15669 Ruby master Bug Open This issue was marked as resolved in 2.5.5 release note but I'm still experiencing it 03/15/2019 04:04 PM Actions
15661 Ruby master Bug Open Disallow concurrent Dir.chdir with block 03/14/2019 08:42 PM Actions
15655 Ruby master Bug Open Unable to handle Russian dirname on Windows 03/11/2019 10:08 AM Actions
15646 Ruby master Bug Open method_defined? inside method_added behaves differently for `initialize` 03/10/2019 06:25 AM Actions
15644 Ruby master Bug Open ThreadsWait problems with Thread#report_on_exception 03/13/2019 12:04 PM Actions
15639 Ruby master Bug Open [BUG] Segmentation fault at 0x000000010e82ca3a 03/05/2019 04:51 PM Actions
15638 Ruby master Bug Open Another race conditions in MonitorMixin when interrupted? 03/05/2019 10:46 AM Actions
15634 Ruby master Bug Open TracePoint seems to be skipping some methods. 03/05/2019 07:35 PM Actions
15629 Ruby master Bug Open super_method fails on binded/unbinded/cloned methods 03/01/2019 12:57 AM Actions
15627 Ruby master Bug Open Appearance of custom singleton classes 03/10/2019 04:40 PM Actions
15625 Ruby master Bug Open Module#name performance has exponential-time worst case by aliased constants 05/22/2019 09:29 AM Actions
15623 Ruby master Bug Open Ruby 2.6.1 Segmentation Fault in on Phusion Passenger server boot in dev 03/19/2019 09:40 AM Actions
15621 Ruby master Bug Open system({}, ...) breaks nonascii ENV["PATH"] on Windows 02/25/2019 08:51 AM Actions
15620 Ruby master Bug Open Block argument usage affects lambda semantic matz (Yukihiro Matsumoto) 07/15/2019 10:02 PM Actions
15613 Ruby master Bug Open Enumerator::Chain#each doesn't relay block signature nobu (Nobuyoshi Nakada) 02/22/2019 04:07 PM Actions
15608 Ruby master Bug Open What should be the correct output for Method#inspect with singleton methods? 02/28/2019 11:49 PM Actions
15601 Ruby master Bug Feedback bug in the Ruby interpreter or extension libraries. 02/13/2019 02:57 AM Actions
15599 Ruby master Bug Open Mixing autoload and require causes deadlock and incomplete definition. 02/12/2019 01:40 PM Actions
15598 Ruby master Bug Open Deadlock on mutual reference of autoloaded constants 03/20/2019 10:58 AM Actions
15589 Ruby master Bug Open `Numeric#zero?` is much slower than `== 0` k0kubun (Takashi Kokubun) 02/07/2019 01:07 AM Actions
15587 Ruby master Bug Open Thread tests failing 03/23/2019 10:06 AM Actions
15583 Ruby master Bug Open Regex: ? on quantified group {n} is interpreted as optional, should be lazy 02/16/2019 05:13 AM Actions
15579 Ruby master Bug Assigned make step when building ruby 2.4.5 on AIX 7.1 results in a Segmentation fault : ruby-2.4.5/lib/rdoc/markup/parser.rb:325 cruby-aix 02/02/2019 06:34 AM Actions
15576 Ruby master Bug Open Wrong error message from some class methods of `Dir` 01/31/2019 01:09 PM Actions
15570 Ruby master Bug Open rb_int2big signature change #14036 breaks VIM on 32b arches 01/30/2019 09:21 AM Actions
15569 Ruby master Bug Open TestResolvDNS#test_no_server always fails on usa's mswin environment ko1 (Koichi Sasada) 04/02/2019 03:01 AM Actions
15558 Ruby master Bug Open Should Exception#exception copy the backtrace? Eregon (Benoit Daloze) 06/05/2019 08:19 PM Actions
15551 Ruby master Bug Open The behavior of FIX2INT and FIX2UINT differs by platform 01/20/2019 09:21 PM Actions
15550 Ruby master Bug Assigned Windows - gem bin files - can't run from bash shell hsbt (Hiroshi SHIBATA) 03/20/2019 01:05 AM Actions
15517 Ruby master Bug Open Net::HTTP not recognizing valid UTF-8 01/20/2019 01:15 AM Actions
15509 Ruby master Bug Open TCPServer#accept isn't interrupted 01/05/2019 06:09 PM Actions
15507 Ruby master Bug Open Thread#raise is delivered to GC context 01/05/2019 06:13 PM Actions
15493 Ruby master Bug Feedback Seg Fault on 'vagrant up' Fedora29 intel 01/11/2019 08:46 AM Actions
15490 Ruby master Bug Open socket.rb - recurring segmentation faults 06/11/2019 02:55 PM Actions
15465 Ruby master Bug Feedback Tests failed on i386-cygwin 01/09/2019 07:55 AM Actions
15449 Ruby master Bug Open Range#=== is not using cover in Ruby 2.6 12/21/2018 01:58 PM Actions
15438 Ruby master Bug Open Threads can't switch faster than TIME_QUANTUM_(NSEC|USEC|MSEC) 03/25/2019 08:53 PM Actions
15433 Ruby master Bug Open OpenStruct NameError vs NoMethodError spec fails for method_missing 12/18/2018 06:25 PM Actions
15428 Ruby master Bug Open Refactor Proc#>> and #<< 01/20/2019 08:04 PM Actions
15425 Ruby master Bug Open Store MJIT header into Ruby versioned directory. 01/03/2019 03:38 PM Actions
15423 Ruby master Bug Open fork leapfrog leaks memory on FreeBSD 11.2 12/16/2018 02:28 PM Actions
15422 Ruby master Bug Open Re: [ruby-cvs:73514] normal:r66413 (trunk): thread_pthread.c: fix memory leak from fork loop leapfrog (v3) 12/16/2018 02:13 PM Actions
15417 Ruby master Bug Open Pathname case insensitive comparison 12/15/2018 04:35 AM Actions
15409 Ruby master Bug Assigned OpenStruct error when attribute is called 'method' marcandre (Marc-Andre Lafortune) 05/09/2019 03:15 PM Actions
15404 Ruby master Bug Open Endless range has inconsistent chaining behaviour 01/30/2019 09:54 PM Actions
15397 Ruby master Bug Open Ruby process doesn't release memory back to os on CentOS 12/11/2018 03:31 AM Actions
15392 Ruby master Bug Open Crash in RubyVM::InstructionSequence#to_binary 12/14/2018 01:50 PM Actions
15386 Ruby master Bug Open [PATCH] io.c (rb_io_check_char_readable): do not io_fflush buffered sockets 12/06/2018 11:38 AM Actions
15375 Ruby master Bug Open Crash report for Ruby 2.5.3p105 02/14/2019 12:39 AM Actions
15372 Ruby master Bug Open openssl 1.1.1a on Debian sid test failures rhenium (Kazuki Yamaguchi) 12/03/2018 11:48 AM Actions
15371 Ruby master Bug Open IRB with ARGV 03/22/2019 02:19 PM Actions
15368 Ruby master Bug Feedback Crash Report log information 01/17/2019 11:15 AM Actions
15367 Ruby master Bug Open IO.select is not resumed when io-object gets closed 12/03/2018 10:22 AM Actions
15359 Ruby master Bug Assigned Bundler help is not properly integrated hsbt (Hiroshi SHIBATA) 12/01/2018 01:01 AM Actions
15357 Ruby master Bug Open Proc#parameters returns incomplete type information 11/30/2018 05:34 AM Actions
15355 Ruby master Bug Open Random segmentation faults in development environment 11/28/2018 06:10 PM Actions
15334 Ruby master Bug Open child_info_fork::abort: address space needed by 'emoji_iso2022_kddi.so' on cygwin nobu (Nobuyoshi Nakada) 12/10/2018 07:14 AM Actions
15315 Ruby master Bug Open ec_switch can still lose interrupts ko1 (Koichi Sasada) 11/20/2018 09:32 AM Actions
15313 Ruby master Bug Open [PATCH] Let debuggers know when a tail call happens ko1 (Koichi Sasada) 12/05/2018 07:05 AM Actions
15310 Ruby master Bug Open [PATCH] thread_pthread.c: close race from UBF_TIMER and non-GVL-releasing thread 11/20/2018 12:50 AM Actions
15309 Ruby master Bug Assigned ECB is broken rhenium (Kazuki Yamaguchi) 03/20/2019 05:19 AM Actions
15306 Ruby master Bug Open Generate prelude.c using miniruby 11/16/2018 09:07 AM Actions
15290 Ruby master Bug Open load_from_binary Bus error on Solaris sparc nagachika (Tomoyuki Chikanaga) 11/08/2018 12:37 PM Actions
15276 Ruby master Bug Open URI.join behaviour is unintuitive 11/02/2018 03:25 AM Actions
15273 Ruby master Bug Open Ruby crashing after updating Mac OS to Mojave (10.14) 11/01/2018 09:38 AM Actions
15268 Ruby master Bug Open Solarisでtest/drb/test_drbssl.rbが落ちる openssl 11/06/2018 03:48 PM Actions
15267 Ruby master Bug Open File.basename + File.extname does not restore the original name 10/29/2018 06:25 AM Actions
15263 Ruby master Bug Open [PATCH] vm_trace.c (postponed_job_register): only hit main thread ko1 (Koichi Sasada) 10/27/2018 11:35 PM Actions
15262 Ruby master Bug Feedback WeakRef::RefError for object that is still in use 10/31/2018 10:07 AM Actions
15255 Ruby master Bug Open Change in protected handling 2.3 -> 2.4,2.5 10/25/2018 10:43 PM Actions
15253 Ruby master Bug Feedback Arduinoとの接続においてSocket.tcp_server_loop中で$stderr.puts、pなどが使用できない 10/28/2018 11:48 AM Actions
15252 Ruby master Bug Open hitting what seems like a gc segfault at random 10/24/2018 07:12 PM Actions
15247 Ruby master Bug Open Windows - TEMP folder, non 8.3 & drive, fails & errors in test-all (ruby & rdoc) 10/23/2018 05:02 PM Actions
15244 Ruby master Bug Open Method #extname return empty string if filename is dot ('.') 02/16/2019 08:01 AM Actions
15241 Ruby master Bug Open net/pop fix to use mutable strings was too eager 10/30/2018 10:17 AM Actions
15240 Ruby master Bug Open Set operations check for is_a?(Set), rather than allowing duck typing knu (Akinori MUSHA) 05/05/2019 07:27 PM Actions
15235 Ruby master Bug Open [patch] appveyor.yml - remove MinGW dll's from mswin testing PATH 10/19/2018 02:41 AM Actions
15233 Ruby master Bug Assigned Speeding Up Matrix Powers marcandre (Marc-Andre Lafortune) 10/23/2018 10:44 PM Actions
15227 Ruby master Bug Open Wrong version of ruby is used during tests 10/16/2018 02:46 PM Actions
15226 Ruby master Bug Open Resolv::DNS unable to handle responses larger than default size 10/16/2018 01:35 PM Actions
15211 Ruby master Bug Open Integer.try_convert 10/07/2018 09:23 AM Actions
15209 Ruby master Bug Open r64925 order-only-prerequisites - make targets - breaking change 10/06/2018 03:51 PM Actions
15204 Ruby master Bug Open globbing should be prevented when wildcard is surrounded by double quotes in the ruby's command line 10/05/2018 08:29 AM Actions
15188 Ruby master Bug Open Incorrect warning "assigned but unused variable" when using ripper with $VERBOSE = true 10/10/2018 11:04 AM Actions
15187 Ruby master Bug Open IPv6 x-forwarded-host results in "bad URI" error 10/01/2018 01:45 PM Actions
15179 Ruby master Bug Feedback Segfault caused by only 'loop{ x<<[] }' 10/01/2018 01:33 PM Actions
15178 Ruby master Bug Open Wrong paramaters passing to pthread_setname_np(3) 09/29/2018 03:43 PM Actions
15177 Ruby master Bug Open 起動した後にTZを変更するとTime#utcがずれることがある 10/09/2018 01:04 PM Actions
15173 Ruby master Bug Open Segmentation fault 09/28/2018 12:50 PM Actions
15170 Ruby master Bug Assigned Allow WEBrick::HTTPServlet::initialize to accept an array in server[:CGIInterpreter] normalperson (Eric Wong) 01/04/2019 03:58 AM Actions
15140 Ruby master Bug Feedback Bug in Interpreter or Extension Libraries 09/19/2018 10:26 AM Actions
15138 Ruby master Bug Open non-symbol keyword in double splat, such as **{2 => 3}, raises TypeError or not 09/18/2018 05:12 PM Actions
15097 Ruby master Bug Open Gem install fails on Ruby 2.5.1 with Cygwin (get_dns_server_list undefined) 09/10/2018 07:18 PM Actions
15082 Ruby master Bug Feedback Memory leak in net/http/response and net/http/header 06/17/2019 11:13 PM Actions
15078 Ruby master Bug Open Hash splat of empty hash should not create a positional argument. matz (Yukihiro Matsumoto) 09/19/2018 01:59 AM Actions
15072 Ruby master Bug Open thread.c:4356:5: error: implicit declaration of function ‘ubf_list_atfork’ normalperson (Eric Wong) 09/20/2018 03:32 AM Actions
15070 Ruby master Bug Feedback configure fails with (probably spurious) 'something wrong with CFLAGS="-g -O2 "' on macOS High Sierra 09/05/2018 05:17 PM Actions
15067 Ruby master Bug Open library/socket/socket/getnameinfo_spec.rb always errors with multiple IP addresses hostname 09/04/2018 06:47 AM Actions
15052 Ruby master Bug Open must not optimize `foo(**{})` out 08/31/2018 12:09 PM Actions
15045 Ruby master Bug Open Test suite fails/hangs with stronger cryptography enforcement 08/29/2018 04:16 PM Actions
15044 Ruby master Bug Open ENV encoding not UTF-8 by default 08/29/2018 06:40 PM Actions
15038 Ruby master Bug Open Appveyor MinGW - bundled gems missing? 08/28/2018 04:17 PM Actions
15034 Ruby master Bug Feedback Crash in Opensuse Software management 08/28/2018 12:12 AM Actions
15033 Ruby master Bug Open Encoding fallback uses wrong character when multiple conversions are required 08/27/2018 09:19 PM Actions
15027 Ruby master Bug Feedback When Struct#each method is overriden Struct#select and Struct#to_a use wrong collections 09/26/2018 10:24 AM Actions
15001 Ruby master Bug Open Peek causes cursor to advance when enumerating the lines of a file 08/22/2018 10:13 AM Actions
14997 Ruby master Bug Open Socket connect timeout exceeds the timeout value for 07/02/2019 10:58 AM Actions
14976 Ruby master Bug Feedback /usr/local/lib/ruby/gems/2.6.0/gems/fluentd-1.2.4/lib/fluent/event.rb:193: [BUG] Segmentation fault at 0x0000000000000000 ruby 2.6.0preview1 (2018-02-24 trunk 62554) [x86_64-linux] 08/14/2018 11:23 AM Actions
14972 Ruby master Bug Open Net::HTTP inconsistently raises EOFError when peer closes the connection 02/12/2019 05:03 AM Actions
14971 Ruby master Bug Open error: implicit declaration of function ‘rb_vm_call0 nobu (Nobuyoshi Nakada) 09/06/2018 03:53 AM Actions
14963 Ruby master Bug Open Since r64107, on Solaris, spec test of rb_io_wait_readable hangs up 08/03/2018 02:49 PM Actions
14961 Ruby master Bug Feedback Segfault when running RSpec / Capybara / Rails 08/03/2018 08:42 AM Actions
14957 Ruby master Bug Open MinGW, gcc 8.2.0, bootstraptest test_thread.rb - failure ? 08/03/2018 02:46 PM Actions
14943 Ruby master Bug Open ruby 2.4 doesn't work with jemalloc 5.1.0 properly. 07/27/2018 10:22 AM Actions
14922 Ruby master Bug Assigned Resolv getaddresses ignores AAAA records for IPv6 akr (Akira Tanaka) 07/25/2018 07:44 AM Actions
14910 Ruby master Bug Feedback /usr/local/Cellar/ruby/2.5.1/lib/ruby/2.5.0/x86_64-darwin17/openssl.bundle: [BUG] Segmentation fault at 0x0000000000000001 07/13/2018 01:15 AM Actions
14909 Ruby master Bug Feedback Method call with object that has to_hash method crashes (method with splat and keyword arguments) 07/13/2018 03:18 PM Actions
14906 Ruby master Bug Open MinGW failure - TestIO#test_copy_stream_no_busy_wait 07/12/2018 03:52 AM Actions
14900 Ruby master Bug Open Extra allocation in String#byteslice 07/08/2018 11:35 AM Actions
14895 Ruby master Bug Open Inconsistent constant names when using const_set on a singleton class 07/05/2018 09:10 PM Actions
14891 Ruby master Bug Open Pathname#join has different behaviour to File.join 07/13/2018 04:58 AM Actions
14889 Ruby master Bug Open TracePoint for :line never seems to trigger on argument list. Maybe by design? 07/01/2018 03:59 PM Actions
14884 Ruby master Bug Feedback msys2 mingw32 'rake' has unexpected text at top of file 07/04/2018 11:20 PM Actions
14879 Ruby master Bug Open Time#+ and Time#- do not preserve receiver's utc_offset if ENV['TZ'] is modified after receiver is created 06/19/2019 07:55 PM Actions
14874 Ruby master Bug Open Segmentation fault under Cygwin 06/27/2018 02:33 PM Actions
14870 Ruby master Bug Open Both TracePoint's :call and :c_call filters seem to skip a lot of builtin methods nobu (Nobuyoshi Nakada) 06/26/2018 02:26 PM Actions
14849 Ruby master Bug Feedback rbenv install 2.4.0 on AWS EC2 on AMI linux box 06/18/2018 12:21 AM Actions
14843 Ruby master Bug Assigned [BUG] Illegal instruction at 0x000000010c7acc0a tenderlovemaking (Aaron Patterson) 06/16/2018 09:35 PM Actions
14838 Ruby master Bug Open RegexpError with double "s" in look-behind assertion in case-insensitive unicode regexp 06/09/2018 04:04 PM Actions
14835 Ruby master Bug Open Impossible to know whether an exception was rescued or not using TracePoint 06/08/2018 08:58 AM Actions
14826 Ruby master Bug Open make: *** [.ext/include/sparc-solaris2.10/rb_mjit_min_header-2.6.0.h] Error 1 on Solaris 10 with very old gcc3 06/05/2018 02:02 PM Actions
14824 Ruby master Bug Open Endless Range Support in irb 06/05/2018 10:45 AM Actions
14823 Ruby master Bug Feedback Endless Range Excluding End 06/05/2018 02:31 PM Actions
14817 Ruby master Bug Assigned TracePoint#parameters for bmethod's return event should return the same value as its Method#parameters ko1 (Koichi Sasada) 07/15/2019 02:51 AM Actions
14810 Ruby master Bug Feedback Segfault during travis build (Ruby trunk 63545) 06/17/2019 11:31 PM Actions
14804 Ruby master Bug Open GzipReader cannot read Freebase dump (but gzcat/zless can) 06/01/2018 10:45 PM Actions
14800 Ruby master Bug Open Zlib::GzipReader#read does not support 2nd argument 05/31/2018 02:32 PM Actions
14761 Ruby master Bug Open TestThread#test_join_limits hangs up on Solaris 10 with gcc 05/16/2018 05:23 AM Actions
14755 Ruby master Bug Open Aborted (core dumped) 05/12/2018 06:20 PM Actions
14752 Ruby master Bug Open abort during build full build log 05/12/2018 12:17 AM Actions
14745 Ruby master Bug Open High memory usage when using String#replace with IO.copy_stream 05/18/2018 06:52 PM Actions
14744 Ruby master Bug Open Refinements modules have a superclass matz (Yukihiro Matsumoto) 05/09/2018 09:09 AM Actions
14743 Ruby master Bug Open Some links broken in README 05/09/2018 05:41 AM Actions
14740 Ruby master Bug Open You may have encountered a bug in the Ruby interpreter or extension libraries. Bug reports are welcome. 05/07/2018 08:47 AM Actions
14737 Ruby master Bug Assigned Split default gems into separate directory structure hsbt (Hiroshi SHIBATA) 05/05/2018 11:15 AM Actions
14732 Ruby master Bug Open CGI.unescape returns different instance between Ruby 2.3 and 2.4 05/03/2018 01:33 AM Actions
14727 Ruby master Bug Assigned TestQueue#test_queue_with_trap always timeout on Windows10 ko1 (Koichi Sasada) 05/01/2018 02:59 AM Actions
14726 Ruby master Bug Open wrong message when superclass is not a Class 05/07/2018 06:39 AM Actions
14716 Ruby master Bug Open SecureRandom throwing an error in Ruby 2.5.1 03/03/2019 10:33 AM Actions
14715 Ruby master Bug Open Pathname#== should compare by #realpath instead of #to_s 04/26/2018 12:37 PM Actions
14714 Ruby master Bug Open Ruby 2.5.1 Segmentation Fault in GC 12/31/2018 07:24 PM Actions
14704 Ruby master Bug Open Module#ancestors looks wrong when a module is both included and prepended in the same class. 04/20/2018 03:23 PM Actions
14695 Ruby master Bug Open [2.5.1] `===` is 1.77x slower than `match?` 04/18/2018 07:57 AM Actions
14682 Ruby master Bug Open Error [BUG] unexpected THREAD_KILLED 04/12/2018 07:09 AM Actions
14681 Ruby master Bug Open `syswrite': stream closed in another thread (IOError) 04/22/2018 12:12 AM Actions
14679 Ruby master Bug Assigned StdLib gems should properly specify their dependencies hsbt (Hiroshi SHIBATA) 04/11/2018 01:14 PM Actions
14678 Ruby master Bug Feedback Segmentation fault in pg 10/28/2018 02:50 PM Actions
14671 Ruby master Bug Open Refining Module#refine itself introduces strange state 04/10/2018 06:27 AM Actions
14667 Ruby master Bug Feedback Segmentation fault in Ruby during iOS automation 04/06/2018 11:52 PM Actions
14663 Ruby master Bug Open getting "killed string.c" rdoc failed while trying to make ruby-2_5_1 04/04/2018 10:03 PM Actions
14662 Ruby master Bug Open Stack consistency error in 2.5.1 04/20/2018 01:40 PM Actions
14659 Ruby master Bug Open segfault in ConditionVariable#broadcast and ConditionVariable#signal 06/27/2018 07:32 AM Actions
14640 Ruby master Bug Open [win32] File.realpath treats a relative path with a drive letter as an absolute path. cruby-windows 12/10/2018 07:09 AM Actions
14635 Ruby master Bug Feedback Float#round(n) returns a wrong result when n is big 03/27/2018 01:57 PM Actions
14631 Ruby master Bug Open Add support for long paths in Windows 10 when support is enabled in the OS 03/26/2018 11:43 AM Actions
14626 Ruby master Bug Assigned One failing test on trunk 58fbe69a5b and OSX ko1 (Koichi Sasada) 03/26/2018 12:53 PM Actions
14616 Ruby master Bug Open Segmentation fault in net/http/response 03/21/2018 04:44 PM Actions
14614 Ruby master Bug Feedback Error when running `make update-gems` 06/20/2019 05:45 PM Actions
14612 Ruby master Bug Assigned IPv6 address inconsistency (downcase vs. upcase) akr (Akira Tanaka) 06/20/2019 06:00 PM Actions
14607 Ruby master Bug Open Fix use of the rb_profile_frames start parameter 04/27/2018 12:30 AM Actions
14605 Ruby master Bug Open Remove `original_iseq` from `rb_iseq_constant_body` 04/09/2018 09:21 PM Actions
14601 Ruby master Bug Open test-all & ruby/test_m17n_comb.rb - fixup 03/13/2018 03:18 PM Actions
14596 Ruby master Bug Open Ruby master is broken with bootsnap 03/23/2018 06:21 AM Actions
14591 Ruby master Bug Open Files with invalid multi-byte characters will cause Find::find() to raise EINVAL exception 03/08/2018 10:25 PM Actions
14583 Ruby master Bug Feedback #method() is reporting the wrong self in exception 03/07/2018 08:23 PM Actions
14582 Ruby master Bug Open Unable to use `method__entry` and `method_return` tracing probes since 2.5 06/05/2018 03:42 AM Actions
14573 Ruby master Bug Open rb_ary_or doesn't check objects hash when the array contains less than SMALL_ARRAY_LEN 03/21/2018 03:01 PM Actions
14570 Ruby master Bug Open Wired behavior of File.expand_path() on Windows 03/03/2018 12:13 AM Actions
14569 Ruby master Bug Feedback Ruby dumps core involving XML file 06/20/2019 06:14 PM Actions
14563 Ruby master Bug Open irb in irb raises a FATAL error 06/19/2019 09:38 PM Actions
14560 Ruby master Bug Open Segmentation fault near the end of large Rails test suite 03/06/2018 04:22 AM Actions
14558 Ruby master Bug Open "Backtrace in reverse order" always upsets my brain! 02/28/2018 09:41 PM Actions
14543 Ruby master Bug Assigned `make commit` show error of `common-srcs` nobu (Nobuyoshi Nakada) 06/02/2018 04:17 AM Actions
14541 Ruby master Bug Open Class variables have broken semantics, let's fix them 01/03/2019 03:26 PM Actions
14505 Ruby master Bug Feedback IO.popen / Open3.popen2 / backtick subprocess remains blocked 02/22/2018 07:11 AM Actions
14488 Ruby master Bug Open Unicode characters prevent [[:punct:]] character class from matching certain characters in subsequent matches 02/18/2018 11:02 PM Actions
14485 Ruby master Bug Open For File#path.tainted? and File#to_path.tainted? should match original.tainted? 06/20/2019 07:00 PM Actions
14480 Ruby master Bug Open miniruby crashing when compiled with -O2 or -O1 on aarch64 04/10/2018 12:04 AM Actions
14479 Ruby master Bug Open Exceptions raised from a :call tracepoint can sometimes be "rescued" inside the method 02/15/2018 03:09 AM Actions
14474 Ruby master Bug Open skip "TestException#test_thread_signal_location" as known bug 12/10/2018 07:09 AM Actions
14471 Ruby master Bug Open DRb mixing up function return values between PIDs after fork() 02/13/2018 05:14 PM Actions
14466 Ruby master Bug Assigned Errno::ECONNRESET or Errno::EPIPE raised instead of HTTPResponse returned when POSTing with large body naruse (Yui NARUSE) 06/20/2019 08:04 PM Actions
14456 Ruby master Bug Open Dir.glob with FNM_CASEFOLD gives ArgumentError: invalid byte sequence in UTF-8 02/07/2018 08:36 PM Actions
14442 Ruby master Bug Open report a bug when I run ruby project 02/05/2018 03:18 AM Actions
14437 Ruby master Bug Open Integer == doesn't work with coerce since 2.4 (and != since 1.9). Should it? 02/04/2018 02:38 PM Actions
14434 Ruby master Bug Open IO#reopen fails after EPIPE 02/02/2018 10:32 AM Actions
14432 Ruby master Bug Open Ruby crashes with "[BUG] pthread_mutex_destroy: Device or resource busy (EBUSY)" 03/29/2018 01:39 AM Actions
14429 Ruby master Bug Assigned Overzealous escaping of + in Shellwords knu (Akinori MUSHA) 06/20/2019 08:27 PM Actions
14422 Ruby master Bug Open Ruby configuration options should not be reused for gem builds 03/05/2018 03:32 PM Actions
14418 Ruby master Bug Open ruby 2.5 slow regexp execution 01/30/2018 07:32 AM Actions
14415 Ruby master Bug Open Empty keyword hashes get assigned to ordinal args. 01/29/2018 03:04 AM Actions
14413 Ruby master Bug Feedback `-n` and `-p` flags break when stdout is closed 01/29/2018 02:17 AM Actions
14409 Ruby master Bug Assigned インストール手順の改善 hsbt (Hiroshi SHIBATA) 02/05/2018 10:29 AM Actions
14408 Ruby master Bug Assigned Add hash argument description for GC.stat and GC.latest_gc_info document ko1 (Koichi Sasada) 08/09/2018 10:44 AM Actions
14400 Ruby master Bug Feedback IO#ungetc and IO#ungetbyte documentation is inconsistent with the behavior akr (Akira Tanaka) 02/21/2018 12:26 AM Actions
14398 Ruby master Bug Open [BUG] Bus Error 01/24/2018 10:41 PM Actions
14391 Ruby master Bug Assigned Integer#digitsが遅い mrkn (Kenta Murata) 01/27/2018 02:24 AM Actions
14387 Ruby master Bug Open Ruby 2.5 を Alpine Linux で実行すると比較的浅めで SystemStackError 例外になる 06/11/2018 01:44 PM Actions
14378 Ruby master Bug Open On windows, RUBY_FIXNUM_MAX of 64 bits ruby is 32 bits 01/21/2018 06:51 AM Actions
14367 Ruby master Bug Open Wrong interpretation of backslash C in regexp literals 01/17/2018 10:28 AM Actions
14365 Ruby master Bug Open irreconcilable ancestor chain ordering expectations should perhaps produce an error 01/16/2018 09:34 PM Actions
14364 Ruby master Bug Open Regexp last match variable in procs 09/14/2018 05:28 AM Actions
14358 Ruby master Bug Assigned URI.encode_www_form_component doesn't encode bad chars properly akira (akira yamada) 06/20/2019 09:50 PM Actions
14353 Ruby master Bug Open $SAFE should stay at least thread-local for compatibility matz (Yukihiro Matsumoto) 02/07/2019 05:23 AM Actions
14334 Ruby master Bug Open Segmentation fault after running rspec (ruby/2.5.0/erb.rb:885 / simplecov/source_file.rb:85) 03/01/2018 02:04 AM Actions
14327 Ruby master Bug Open Segmentation fault while compiling ruby 2.5 on alpine armhf 01/07/2018 04:06 PM Actions
14325 Ruby master Bug Assigned Set#reset raise RuntimeError instead of FrozenError knu (Akinori MUSHA) 01/06/2018 03:32 PM Actions
14275 Ruby master Bug Open GC not aggressive enough 01/03/2018 09:18 AM Actions
14271 Ruby master Bug Open Random TestIO_Console#test_oflush failure 01/02/2018 02:09 PM Actions
14267 Ruby master Bug Open Lazy proc allocation introduced in #14045 creates regression 01/02/2018 06:47 AM Actions
14266 Ruby master Bug Open Set#clone(freeze: false) makes frozen internal hash knu (Akinori MUSHA) 01/06/2018 05:29 AM Actions
14263 Ruby master Bug Open Array Intersection does not seem to use hash 03/25/2018 09:41 PM Actions
14241 Ruby master Bug Assigned Time.strptime() doesn't support the directive "%W". akr (Akira Tanaka) 06/21/2019 05:48 PM Actions
14240 Ruby master Bug Open warn four special variables: $; $, $/ $\ 01/25/2018 10:09 AM Actions
14202 Ruby master Bug Open gem install rails fails 12/18/2017 08:54 PM Actions
14198 Ruby master Bug Feedback Error forwarding standard input to subprocess 01/04/2018 06:26 PM Actions
14176 Ruby master Bug Open Unclear error message when calling method with keyword arguments 12/13/2017 06:34 PM Actions
14175 Ruby master Bug Open TestResolvMDNS#test_mdns_each_address fails 12/13/2017 04:16 PM Actions
14161 Ruby master Bug Open Getting segmentation fault some time while running rspec 12/08/2017 12:31 PM Actions
14160 Ruby master Bug Open JSON#generate documentation wrong/misleading 12/08/2017 11:19 AM Actions
14157 Ruby master Bug Feedback You may have encountered a bug in the Ruby interpreter or extension libraries. 12/07/2017 03:15 AM Actions
14156 Ruby master Bug Feedback broken bundler install 12/07/2017 09:02 PM Actions
14148 Ruby master Bug Open Longstanding behavior regarding correspondence of toplevel with Object is surprising 12/04/2017 04:09 AM Actions
14137 Ruby master Bug Open Windows / MinGW - Regexp - Character Properties - General Category 11/29/2017 07:17 AM Actions
14130 Ruby master Bug Open Keyword arguments are ripped from the middle of hash if argument have default value nobu (Nobuyoshi Nakada) 09/05/2018 03:44 PM Actions
14125 Ruby master Bug Open Readline Module (STDLIB): Add support for ^O emacs keybinding? 11/22/2017 08:58 PM Actions
14121 Ruby master Bug Open test-all - rename duplicate classes for consistent test count 11/20/2017 05:52 PM Actions
14120 Ruby master Bug Open Gem bundle installation on ruby 2.2.2 11/20/2017 05:19 PM Actions
14119 Ruby master Bug Assigned IPAddr#include? does not seem to support the subnet mask knu (Akinori MUSHA) 11/20/2017 05:42 AM Actions
14113 Ruby master Bug Feedback Crashed Thread: 15 thread_pool.rb* 11/17/2017 03:01 AM Actions
14106 Ruby master Bug Feedback [BUG] Segmentation fault 11/16/2017 05:05 AM Actions
14103 Ruby master Bug Open Regexp absense operator has no chance to ^C 11/13/2017 11:15 AM Actions
14102 Ruby master Bug Open Date.strptime ignores constraints provided by day name 11/13/2017 08:03 AM Actions
14100 Ruby master Bug Open segfault in vm_exec during compile 11/10/2017 08:20 PM Actions
14099 Ruby master Bug Feedback heap-use-after-free (WRITE of size 8) in rb_obj_write (include/ruby/ruby.h:1484) 06/24/2019 05:15 PM Actions
14096 Ruby master Bug Assigned Psych allows invalid single quote escape character hsbt (Hiroshi SHIBATA) 07/26/2018 11:07 AM Actions
14094 Ruby master Bug Open IRB does not obey frame-level visibility modifiers 11/09/2017 04:46 PM Actions
14090 Ruby master Bug Open `TestGc#test_interrupt_in_finalizer` fails very rarely kosaki (Motohiro KOSAKI) 12/19/2017 06:36 AM Actions
14089 Ruby master Bug Feedback Configure/build issue on OSX 10.12 w/ utimensat 11/10/2017 03:32 AM Actions
14083 Ruby master Bug Open Refinement in block calling incorrect method 11/05/2017 07:36 PM Actions
14081 Ruby master Bug Open Compile failure in "make install" step, at "stringio" 11/05/2017 10:31 AM Actions
14080 Ruby master Bug Open Performance issue with Marshal.dump and Array of Floats - 100x regression in 2.3.x 11/05/2017 05:14 AM Actions
14072 Ruby master Bug Feedback Ruby interpreter 12/07/2017 07:44 AM Actions
14069 Ruby master Bug Assigned Document order of elements in Set knu (Akinori MUSHA) 06/24/2019 05:09 PM Actions
14064 Ruby master Bug Open test-all with and without -j - incorrect assertions and missing test methods 11/03/2017 10:54 PM Actions
14062 Ruby master Bug Open Top-level return allows an argument 02/20/2018 07:12 AM Actions
14053 Ruby master Bug Open Problem with case/when menus in ruby 2.5.0dev (2017-10-25) [x86_64-linux] - semi-random tracebook of different errors (NODE_STR, NODE_ARGS etc...) and also segfaults sometimes 10/25/2017 11:07 AM Actions
14051 Ruby master Bug Assigned net/imap issue on idle method with an empty block shugo (Shugo Maeda) 10/25/2017 04:41 AM Actions
14049 Ruby master Bug Open SEGV svn 60401 require_relative 10/26/2017 05:25 PM Actions
14046 Ruby master Bug Open Ripper loses DATA 10/24/2017 08:15 AM Actions
14028 Ruby master Bug Open RubyVM logic backported into Ruby 2.3 tests 10/18/2017 07:22 PM Actions
14026 Ruby master Bug Feedback RUBY ERROR ON DIVISION with FDIV 06/24/2019 05:35 PM Actions
14015 Ruby master Bug Open Enumerable & Hash yielding arity matz (Yukihiro Matsumoto) 06/01/2018 03:10 AM Actions
14012 Ruby master Bug Open NameError is raised when use class variables in Refinements 10/13/2017 01:43 PM Actions
14010 Ruby master Bug Open RubyVM logic in forwardable backported to 2.3, not removed 10/13/2017 02:45 AM Actions
14004 Ruby master Bug Open ri confused by method aliases and by Queue versus Thread::Queue 10/12/2017 10:30 PM Actions
13999 Ruby master Bug Assigned Cygwin 環境で ripper_state_lex.rb がコアダンプする aycabta (aycabta .) 11/06/2018 04:51 PM Actions
13992 Ruby master Bug Open Strange behaviour for kernel#integer method 10/10/2017 11:04 AM Actions
13980 Ruby master Bug Feedback Rounding failure on i686 (i386). 10/06/2017 07:40 AM Actions
13970 Ruby master Bug Open Base64 urlsafe_decode64 unsafe use of tr. 10/04/2017 01:29 PM Actions
13966 Ruby master Bug Open configure.in still needed ?! nobu (Nobuyoshi Nakada) 10/07/2017 08:25 AM Actions
13962 Ruby master Bug Assigned Change http://unicode.org to https duerst (Martin Dürst) 12/12/2017 02:11 PM Actions
13948 Ruby master Bug Open Segfault instead of recursion depth error 09/28/2017 08:23 PM Actions
13932 Ruby master Bug Open [PATCH] Extension libraries take precedence in checks of later Kernel.#require calls for features without file extensions 09/23/2017 04:48 PM Actions
13930 Ruby master Bug Open Exception is caught in rescue above ensure 10/28/2018 09:13 AM Actions
13920 Ruby master Bug Open prepping io for stdin returns "access denied" on windows 09/20/2017 07:49 AM Actions
13918 Ruby master Bug Assigned Appveyor failure - svn 59961 Use https instead of ftp for libffi downloading hsbt (Hiroshi SHIBATA) 09/19/2017 01:44 PM Actions
13917 Ruby master Bug Assigned Comparable#clamp is slower than using Array#min,max. nobu (Nobuyoshi Nakada) 10/09/2017 02:13 AM Actions
13907 Ruby master Bug Assigned Operation not permitted (Errno::EPERM) when adjusting .irbrc_history file permissions keiju (Keiju Ishitsuka) 06/24/2019 06:19 PM Actions
13903 Ruby master Bug Open cant compile ruby with /MT on windows 09/18/2017 07:19 AM Actions
13891 Ruby master Bug Open Rake - no files in bin folder - 59839 09/12/2017 03:47 AM Actions
13882 Ruby master Bug Assigned Exception in `ensure` stops threads from exiting ko1 (Koichi Sasada) 02/26/2018 06:26 PM Actions
13876 Ruby master Bug Open Tempfile's finalizer can be interrupted by a Timeout exception which can cause the process to hang 09/12/2017 01:27 AM Actions
13864 Ruby master Bug Assigned Rinda multicast test failures due to missing default route seki (Masatoshi Seki) 09/07/2017 07:10 AM Actions
13841 Ruby master Bug Open Segmentation fault in Ruby CFUNC :to_s 10/05/2017 10:29 PM Actions
13835 Ruby master Bug Open Using 'open-uri' with 'tempfile' causes an exception 08/25/2017 02:03 AM Actions
13834 Ruby master Bug Feedback RubyGems test suite occasionally changes working directory and breaks the rest of test suite hsbt (Hiroshi SHIBATA) 03/11/2019 07:39 AM Actions
13827 Ruby master Bug Open Improve performance of `Base64.urlsafe_encode64` 08/18/2017 10:59 AM Actions
13811 Ruby master Bug Open Ruby 2.4.1 fails to compile inside qemu armhf - signal 11 (Segmentation fault) 08/13/2017 09:45 PM Actions
13783 Ruby master Bug Feedback Memory allocation / GC does not free unused memory 08/07/2017 09:14 PM Actions
13778 Ruby master Bug Feedback net/http.rb:879 TCPSocket.open fail 08/02/2017 02:14 AM Actions
13768 Ruby master Bug Open SIGCHLD and Thread dead-lock problem 07/27/2017 06:08 AM Actions
13758 Ruby master Bug Feedback TestRubyOptions#test_segv_setproctitle segfaults on AARCH64 11/29/2018 02:14 PM Actions
13754 Ruby master Bug Assigned bigdecimal with lower precision that Float mrkn (Kenta Murata) 05/20/2018 09:16 PM Actions
13752 Ruby master Bug Assigned Can't observe sibling refinements 07/18/2017 06:27 AM Actions
13750 Ruby master Bug Open Improve String#casecmp? and Symbol#casecmp? performance with ASCII string 07/17/2017 06:39 AM Actions
13749 Ruby master Bug Feedback Encountered a bug in the Ruby interpreter or extension libraries. 07/17/2017 01:56 AM Actions
13716 Ruby master Bug Open Unexpected or undocumented (or maybe both) behaviour when mixing String#scan with named captures 07/25/2017 12:27 AM Actions
13708 Ruby master Bug Open catastrophic slow compilation of defined-defined sequence has no chance to ^C 07/03/2017 03:35 AM Actions
13700 Ruby master Bug Open Enumerable#sum may not work for Ranges subclasses due to optimization 06/30/2017 11:45 AM Actions
13688 Ruby master Bug Open Thread overflow hangs ruby (not responding ^C) 06/28/2017 03:50 AM Actions
13675 Ruby master Bug Open Should Zlib::GzipReader#ungetc accept nil? 12/01/2017 07:01 PM Actions
13674 Ruby master Bug Assigned BigDecimal comparison with Float::INFINITY is erroneous in 2.2.x and 2.3.x mrkn (Kenta Murata) 08/30/2017 08:50 AM Actions
13671 Ruby master Bug Open Regexp with lookbehind and case-insensitivity raises RegexpError only on strings with certain characters 08/29/2018 10:20 AM Actions
13670 Ruby master Bug Feedback [BUG] Bus Error at 0xefce7b (armv7l) (ruby 2.3.4p301) 06/21/2018 08:10 AM Actions
13664 Ruby master Bug Feedback encountered a bug in the Ruby interpreter or extension libraries 06/16/2017 05:00 AM Actions
13663 Ruby master Bug Open `String#upto` doesn't work as expected 06/23/2017 11:47 AM Actions
13660 Ruby master Bug Open rb_str_hash_m discards bits from the hash 07/17/2017 04:11 PM Actions
13654 Ruby master Bug Assigned irb save-history extension is not concurrency-safe keiju (Keiju Ishitsuka) 07/14/2017 09:28 AM Actions
13650 Ruby master Bug Open Sporadic Ruby Crashing 06/09/2017 06:07 PM Actions
13647 Ruby master Bug Open Some weird behaviour with keyword arguments matz (Yukihiro Matsumoto) 09/05/2018 03:38 PM Actions
13646 Ruby master Bug Open Segmentation fault with postgresql_adapter in Rails 06/09/2017 08:57 AM Actions
13644 Ruby master Bug Open Windows - Setting Time.now 06/11/2017 03:43 AM Actions
13635 Ruby master Bug Feedback ruby and linux-pf or linux-zen kernels 06/19/2017 08:34 AM Actions
13617 Ruby master Bug Open ruby 2.3.4 will not run nor install on same disk but different machine 05/31/2017 06:14 PM Actions
13612 Ruby master Bug Feedback Segmentation Fault 05/31/2017 04:44 AM Actions
13607 Ruby master Bug Open .rvm/rubies/ruby-2.4.0/lib/ruby/2.4.0/forwardable.rb:228: [BUG] Segmentation fault at 0x00000000000038 05/29/2017 02:00 AM Actions
13603 Ruby master Bug Open SecureRandom.uuid is not valid v4 and/or RFC 4122 05/27/2017 03:17 PM Actions
13594 Ruby master Bug Open Segfault in gc_sweep_step 2.4.1 05/25/2017 01:08 AM Actions
13586 Ruby master Bug Assigned Ruby hangs when accessing array which is modified in instance_eval after Coverage.start nobu (Nobuyoshi Nakada) 11/17/2017 08:20 PM Actions
13584 Ruby master Bug Open Crash in logging (os_log) on MBP 05/19/2017 07:53 PM Actions
13580 Ruby master Bug Feedback bug 06/02/2017 03:07 AM Actions
13574 Ruby master Bug Open Method redefinition warning 05/25/2017 05:43 PM Actions
13571 Ruby master Bug Open Script arguments, encoding, windows / MinGW 11/12/2017 10:53 PM Actions
13564 Ruby master Bug Open Exception message management matz (Yukihiro Matsumoto) 07/14/2017 09:20 AM Actions
13556 Ruby master Bug Open MinGW readline Alt / Meta keys 07/16/2017 11:43 PM Actions
13549 Ruby master Bug Open MinGW / Windows encoding - Two issues 07/17/2017 12:04 AM Actions
13548 Ruby master Bug Feedback miniruby SEGV while building with non-default CFLAGS (caused by __builtin_setjmp) 06/02/2017 09:43 PM Actions
13542 Ruby master Bug Open MinGW trunk Builds - Summary of Issues 05/19/2017 07:04 PM Actions
13535 Ruby master Bug Feedback Installing Ruby2.4.1 on Solaris 10 07/14/2017 07:35 AM Actions
13513 Ruby master Bug Assigned Resolv::DNS::Message.decode hangs after detecting truncation in UDP messages akr (Akira Tanaka) 07/15/2017 11:25 AM Actions
13501 Ruby master Bug Open Process.kill behaviour for negative pid is not documented and may be wrong 07/15/2017 09:13 PM Actions
13500 Ruby master Bug Open MinGW TestArity#test_proc_err_mess stops testing 04/26/2017 03:27 PM Actions
13490 Ruby master Bug Feedback segmentation fault while parsing object to time and adding to array 04/21/2017 12:21 PM Actions
13485 Ruby master Bug Open MinGW TestEnumerable#test_callcc SEGV info 04/19/2017 04:17 PM Actions
13446 Ruby master Bug Assigned refinements with prepend for module has strange behavior nobu (Nobuyoshi Nakada) 06/16/2017 02:28 AM Actions
13441 Ruby master Bug Feedback building - GIT variable, ruby, rubygems tests 04/16/2017 11:18 PM Actions
13431 Ruby master Bug Assigned sample/drb/http0*.rb is not working. seki (Masatoshi Seki) 04/28/2017 01:45 PM Actions
13421 Ruby master Bug Feedback problem rails c 04/13/2017 05:57 AM Actions
13410 Ruby master Bug Feedback [BUG] Segmentation fault at file read 04/10/2017 12:53 PM Actions
13397 Ruby master Bug Open #object_id should not be signed 12/13/2018 01:09 AM Actions
13392 Ruby master Bug Open TracePoint doesn't work correct with monkey patches / aliased methods 03/31/2017 08:39 PM Actions
13377 Ruby master Bug Feedback Crash while running tests 03/29/2017 12:52 AM Actions
13375 Ruby master Bug Feedback msfconsole up to date not work with ruby installer rvm version 2.3.3 2.4.0 2.4.1 correctly ruby kali rolling 04/04/2017 09:22 AM Actions
13373 Ruby master Bug Feedback FileUtils methods for copy, move and remove directories is not providing a decent error trace for letting know if it was success or fail 05/19/2017 07:12 AM Actions
13372 Ruby master Bug Feedback File class is not able to identify EOL for file text using CR character . 03/28/2017 05:58 AM Actions
13349 Ruby master Bug Feedback Ruby unable to open files in /dev on AIX if compiled on AIX 7.1 or later 03/27/2017 08:26 AM Actions
13348 Ruby master Bug Open win32/README.win32 のアイコンがリンク切れ 03/29/2017 01:50 PM Actions
13347 Ruby master Bug Feedback bug in the Ruby interpreter or extension libraries when using rails s 03/22/2017 10:22 AM Actions
13331 Ruby master Bug Assigned Inconsistent conversion of Float into Decimal mrkn (Kenta Murata) 03/29/2017 02:16 PM Actions
13320 Ruby master Bug Feedback rescue blocks get an entry in backtrace locations ko1 (Koichi Sasada) 05/19/2017 06:26 AM Actions
13311 Ruby master Bug Open Segmentation fault while running rspec 04/12/2017 01:33 AM Actions
13307 Ruby master Bug Feedback Changing scheme from http to https for the URI does not change the port number 03/14/2017 10:34 AM Actions
13298 Ruby master Bug Assigned mingw SEGV TestEnumerable#test_callcc nobu (Nobuyoshi Nakada) 03/13/2017 08:56 AM Actions
13274 Ruby master Bug Feedback Ruby interpreter when using Puma. 03/03/2017 11:07 AM Actions
13269 Ruby master Bug Assigned test/readline/test_readline.rb and mingw nobu (Nobuyoshi Nakada) 03/13/2017 08:56 AM Actions
13264 Ruby master Bug Assigned Binding#irb does not work in context of frozen object nobu (Nobuyoshi Nakada) 04/17/2017 09:33 AM Actions
13258 Ruby master Bug Open Segmentation fault at 0x00000000000000 during instance_eval 03/09/2017 03:33 AM Actions
13257 Ruby master Bug Feedback Symbol#singleton_class should be undef 04/17/2017 06:30 AM Actions
13255 Ruby master Bug Feedback segmentation fault 02/26/2017 09:44 AM Actions
13249 Ruby master Bug Assigned Access modifiers don't have an effect inside class methods in Ruby >= 2.3 ko1 (Koichi Sasada) 05/19/2017 07:34 AM Actions
13243 Ruby master Bug Feedback Test suite failure 02/23/2017 01:04 AM Actions
13235 Ruby master Bug Open [BUG] Segmentation fault at 0x00000000000038 03/19/2017 05:05 AM Actions
13220 Ruby master Bug Feedback Enhance support of Unicode strings manipulation 06/14/2019 08:58 PM Actions
(1-500/2409) Per page: 50, 100, 200, 500

Also available in: Atom CSV PDF