Apply Clear

# Project Tracker Status Subject Assignee Updated
8227 Backport200 Backport Closed addr2line.c compile error on Solaris since r39887 nagachika (Tomoyuki Chikanaga) 04/12/2013 02:33 AM Actions
14200 Ruby master Bug Closed addr2line.c compile error with C89 compilers on Solaris 10 01/06/2019 02:17 PM Actions
4998 Ruby master Bug Closed addr2line.c with SunStudio (Oracle Solaris Studio) cc 07/08/2011 09:23 PM Actions
11353 Ruby master Bug Closed ASYNC BUG after failure of Process.exec when closing FD 3 (or 4 or 5) 07/15/2015 02:26 PM Actions
8228 Backport193 Backport Closed atomic_ops unavailable on Solaris 9 or earlier usa (Usaku NAKAMURA) 05/14/2013 11:23 AM Actions
5967 Backport193 Backport Closed Backport r33049 (test_script_from_stdin のエラー) 02/08/2012 10:51 AM Actions
8150 Backport200 Backport Closed Backport r39860 nagachika (Tomoyuki Chikanaga) 04/12/2013 04:23 AM Actions
14875 Ruby master Bug Closed /bin/sh: bad substitution 06/17/2019 11:25 PM Actions
14876 Ruby master Bug Closed /bin/sh: bad substitution since r63679 on Solaris nobu (Nobuyoshi Nakada) 07/02/2018 01:51 PM Actions
11219 Ruby master Bug Closed bootstrap test failed on sparc Solaris since r50743 ko1 (Koichi Sasada) 06/30/2015 03:39 AM Actions
5762 Ruby master Bug Closed Bug#4178 が sparc Solaris 10 + Oracle Solaris Studio 12.2 で再発 12/19/2011 02:13 AM Actions
11245 Ruby master Bug Closed Build failure on Solaris 10 with gcc since r50804 06/30/2015 03:46 AM Actions
10089 Ruby master Bug Closed build failure since r46924 nobu (Nobuyoshi Nakada) 07/24/2014 12:14 PM Actions
9558 Ruby master Bug Closed Bus Error on Sparc in r45155 due to __attribute__((packed)) 02/24/2014 11:19 AM Actions
10088 Ruby master Bug Closed Bus Error on Sparc Solaris since r46884 07/24/2014 07:13 AM Actions
5469 Ruby master Bug Closed Bus Error when accessing NAN and INFINITY ngoto (Naohisa Goto) 10/22/2011 02:35 AM Actions
4977 Ruby master Bug Closed CFLAGSやLDFLAGSの-m64が消されるためsparc64(sparc v9)バイナリ作成不能 nobu (Nobuyoshi Nakada) 07/16/2011 05:29 PM Actions
11277 Ruby master Bug Closed "code converter not found" error with multi-thread (high occurrence rate since r50887) 08/17/2015 07:23 AM Actions
12701 Ruby master Bug Closed compile error about ALWAYS_INLINE 08/24/2016 11:13 AM Actions
10350 Ruby master Bug Closed compile error in bignum.c line 3297 with old fcc on Solaris ngoto (Naohisa Goto) 11/06/2014 02:20 PM Actions
5878 Backport193 Backport Closed compile error in string.c:2096 since r34236 usa (Usaku NAKAMURA) 04/11/2013 11:22 AM Actions
5464 Ruby master Bug Closed compile error in vm_eval.c ngoto (Naohisa Goto) 10/20/2011 09:35 PM Actions
13658 Ruby master Bug Closed Compile error with Oracle Solaris Studio (Oracle Developer Studio) 12.4 in compile.c line 1622 (definition of BADINSN_ERROR) 06/14/2017 04:27 AM Actions
12575 Ruby master Bug Closed Conditional jump or move depends on uninitialised value(s) at rb_wait_for_single_fd (thread.c:3864) 08/18/2016 02:05 PM Actions
14746 Ruby master Bug Closed $cppflags が ext/zlib/Makefile に反映されないため(?) Solaris 10 にて ext/zlib のmakeに失敗する 05/11/2018 03:46 PM Actions
11265 Ruby master Bug Closed deadlock on Solaris 10 since r50900 ngoto (Naohisa Goto) 06/30/2015 03:15 AM Actions
7514 Ruby master Bug Closed DL::Function and DL::Importer#bind_function ignores abi and name when Fiddle is available ngoto (Naohisa Goto) 12/12/2012 12:12 AM Actions
7516 Backport193 Backport Closed DL::Function#bind causes SEGV when Fiddle is available usa (Usaku NAKAMURA) 12/20/2012 06:36 PM Actions
7543 Ruby master Bug Closed DL::Function#bound? and unbind raise error when Fiddle is available 12/12/2012 12:24 AM Actions
12559 Ruby master Bug Closed ./enc/iso_8859_14.c, line 253: error: syntax error near / with old fcc on Solaris 10 08/04/2016 07:43 AM Actions
11843 Ruby master Bug Closed enc/windows_1250.c syntax error with fcc on Solaris -- C++(C99)-style comments should not be used 03/25/2016 08:19 AM Actions
14751 Ruby master Bug Closed error during transform_mjit_header.rb on Solaris 10 05/11/2018 04:48 PM Actions
10915 Ruby master Bug Closed Error in FTPTest#test_abort and test_status on Solaris 03/02/2015 03:07 AM Actions
10010 Ruby master Bug Closed Error in TestEnv#test_memory_leak_* on Solaris nobu (Nobuyoshi Nakada) 07/09/2014 11:32 AM Actions
9789 Ruby master Bug Closed Error in TestIO#test_seek_symwhence and TestIO#test_seek on systems without File::Statfs#type (e.g. Solaris) ngoto (Naohisa Goto) 05/02/2014 03:21 AM Actions
11394 Ruby master Bug Closed Error in test/rinda/test_rinda.rb when IPv6 address is only ::1 assigned to the loopback device 07/24/2015 11:30 AM Actions
9571 Ruby master Bug Closed "Error: TestFileUtils#test_rmdir: Errno::EEXIST: File exists @ dir_s_rmdir - data" on Solaris 08/31/2014 07:24 AM Actions
14199 Ruby master Bug Closed eval_error.c compile error with Oracle Solaris Studio (Oracle Developer Studio) 12.4 on Solaris 10 12/18/2017 04:02 PM Actions
12524 Ruby master Bug Closed Excess semicolons in ext/digest and ext/openssl 08/16/2016 03:13 AM Actions
6027 Ruby master Bug Closed Failure: test_modify_expand_memory_leak(Test_StringModifyExpand) 02/15/2012 05:13 AM Actions
10384 Ruby master Bug Closed Fiddle::DLError: unknown symbol "Init_objspace" during Fiddle::TestHandle#test_NEXT and Fiddle::TestHandle#test_static_sym on Solaris 03/28/2016 05:50 PM Actions
7483 Ruby master Bug Closed Fiddle::Function::STDCALL is never defined even on WIN32 tenderlovemaking (Aaron Patterson) 12/01/2012 12:57 AM Actions
7484 Ruby master Bug Closed Fiddle::Importer incompatibility with DL::Importer tenderlovemaking (Aaron Patterson) 12/04/2012 06:00 PM Actions
7518 Ruby master Feature Assigned Fiddle::Pointer#to_str and Fiddle::Pointer#to_int should be removed tenderlovemaking (Aaron Patterson) 08/15/2013 04:56 AM Actions
12537 Ruby master Bug Closed Fiddle::TestPointer#test_to_s and test_to_str destroy literal string data 09/30/2016 03:44 PM Actions
5160 Ruby master Bug Closed Float::INFINITY and Float::NAN incorrect in big endian architecture ngoto (Naohisa Goto) 08/05/2011 10:28 PM Actions
9257 Ruby master Bug Closed flock OS dependency problem in RubyGems drbrain (Eric Hodel) 12/19/2013 12:05 PM Actions
8810 Ruby master Bug Open GDBM.open内で処理がブロックしたらTimeout.timeout が効かない 12/30/2019 03:00 AM Actions
11487 Ruby master Bug Closed id_table.c compile error by fcc on Solaris 10 09/29/2015 08:42 AM Actions
10004 Ruby master Bug Closed lack of "http 80/tcp" in /etc/inet/services in Solaris 10 causes error during make test-all 10/28/2015 03:47 PM Actions
8901 Ruby master Bug Closed "-lgmp: not found" でlibruby-static.a 作成に失敗する nobu (Nobuyoshi Nakada) 09/12/2013 09:47 PM Actions
5168 Ruby master Bug Closed libc and libm path in test/dl and test/fiddle on Solaris ngoto (Naohisa Goto) 08/09/2011 12:56 PM Actions
11742 Ruby master Bug Closed lib/webrick/utils.rb:196:in `register': ERROR RuntimeError: can't add a new key into hash during iteration nahi (Hiroshi Nakamura) 02/03/2016 11:30 AM Actions
14826 Ruby master Bug Open make: *** [.ext/include/sparc-solaris2.10/rb_mjit_min_header-2.6.0.h] Error 1 on Solaris 10 with very old gcc3 06/05/2018 02:02 PM Actions
11243 Ruby master Bug Closed make install failed on Solaris10 06/30/2015 03:46 AM Actions
12471 Ruby master Bug Closed make update-mspec always fails on Solaris 08/04/2016 05:45 AM Actions
899 Ruby master Bug Closed matrix.rb: warning: shadowing outer local variable 04/30/2011 10:03 PM Actions
12479 Ruby master Bug Closed mistaken macro GCC_VERSION_SINCE 08/04/2016 05:59 AM Actions
7463 Ruby master Bug Closed OpenSSL::TestSSL#test_npn_* fail with "string contains null byte" on big-endian machines MartinBosslet (Martin Bosslet) 11/29/2012 10:54 PM Actions
11684 Ruby master Bug Closed Pack#unpack test failure on Solaris 10 with Oracle Solaris Studio 12.4 ngoto (Naohisa Goto) 12/19/2017 04:55 PM Actions
7552 Backport193 Backport Closed please backport Fiddle and DL bug fixes 12/20/2012 06:45 PM Actions
9531 Backport193 Backport Closed please backport r34605 02/22/2014 01:02 AM Actions
7287 Ruby master Bug Closed please rename atomic.h which conflicts with /usr/include/atomic.h in Solaris10 ngoto (Naohisa Goto) 11/10/2012 01:14 AM Actions
14786 Ruby master Bug Closed PTY duplicated "\r" problem on Solaris 05/23/2018 03:59 PM Actions
5159 Ruby master Bug Closed r32777のためSolaris上のgcc-4.4でCFLAGS="-std=gnu99"のときコンパイルエラー ngoto (Naohisa Goto) 08/05/2011 04:03 PM Actions
5439 Ruby master Bug Closed r33361以降sample/test.rb:systemがFになる 10/13/2011 06:04 PM Actions
5475 Ruby master Bug Closed r33507以降SolarisでPTYが使えない 10/25/2011 11:23 AM Actions
6591 Ruby master Bug Third Party's Issue r35101以降、古いfccで拡張ライブラリのコンパイルに失敗 06/14/2012 03:37 PM Actions
6689 Ruby master Bug Closed r36284: symbol referenceng error: atomic_swap_long in Solaris 07/04/2012 12:29 PM Actions
7247 Ruby master Bug Closed r37079以降Solaris10でthread_pthread.cがコンパイルエラー 11/01/2012 07:47 PM Actions
7451 Ruby master Bug Closed r37911 breaks build on non gcc or non IA-32 platforms naruse (Yui NARUSE) 11/28/2012 03:29 PM Actions
8524 Ruby master Bug Closed r40755以降 No rule to make target `.ext/include/sparc64-solaris2.10/ruby/config.h でビルドできない nobu (Nobuyoshi Nakada) 06/17/2013 12:59 PM Actions
8790 Ruby master Bug Closed r41424 以降、Solaris と gdbm 1.1.10 にて TestGDBM#test_s_open_lock が終わらない nobu (Nobuyoshi Nakada) 10/21/2019 10:47 PM Actions
9436 Ruby master Bug Closed r44670以降Solaris10でthread_pthread.cがコンパイルエラー 02/05/2014 02:58 AM Actions
9530 Backport193 Backport Closed r44946 introduces compile error in Solaris 02/18/2014 02:16 PM Actions
9702 Ruby master Bug Closed r45488以降、SolarisStudioで ext/readline がコンパイルエラー(readline 6.2使用) 05/01/2014 12:00 PM Actions
9698 Ruby master Bug Closed r45509以降、Solarisにて configureが thread model is missing でエラー nobu (Nobuyoshi Nakada) 08/25/2014 03:06 PM Actions
9752 Ruby master Bug Closed r45598 causes Errno::EINVAL on Solaris nobu (Nobuyoshi Nakada) 07/02/2014 07:10 AM Actions
10808 Ruby master Bug Closed r49451以降 Solarisにてruby-glommed.oの作成に失敗 02/18/2015 07:07 AM Actions
10926 Ruby master Bug Closed r49760以降Solarisで--enable-sharedのビルドでsample/test.rb失敗 03/02/2015 04:06 PM Actions
11000 Ruby master Bug Closed r50071以降、Solarisにてext/-test-/file/fs.cのコンパイルができない 05/24/2015 03:46 PM Actions
11225 Ruby master Bug Closed r50776 + r50780 + r50781 changes behavior on systems without HAVE_STRUCT_MSGHDR_MSG_CONTROL 06/30/2015 04:01 AM Actions
11743 Ruby master Bug Closed r52758 以降 config.guess がダウンロードできない 12/07/2015 07:28 AM Actions
5636 Backport193 Backport Closed Re: Continuation causes Bus Error on Debian sparc 01/03/2012 07:14 PM Actions
13059 Ruby master Bug Closed "regcomp.c", line 2236: error: syntax error near `/' with old fcc on Solaris 10 ngoto (Naohisa Goto) 12/21/2016 03:21 PM Actions
11944 Ruby master Bug Closed ruby lib version (2.4.0) doesn't match executable version (RUBY_PROGRAM_VERSION_MAJOR.RUBY_PROGRAM_VERSION_MINOR.0) (RuntimeError) ngoto (Naohisa Goto) 01/04/2016 03:12 AM Actions
1967 Ruby master Bug Rejected Segmentation fault at test_qsort1 and test_qsort2 in test/dl/test_func.rb running on sparc-solaris-2.10 tenderlovemaking (Aaron Patterson) 04/30/2011 10:03 PM Actions
6584 Ruby master Bug Closed Segmentation fault in DL::TestFunc#test_qsort1 on sparc Solaris10 ngoto (Naohisa Goto) 06/13/2012 10:52 PM Actions
7591 Ruby master Bug Closed SEGV on sparc Solaris10 when Marshal.dump 12/19/2012 11:47 PM Actions
11095 Ruby master Bug Closed severe performance regression since r50336 05/21/2015 01:42 AM Actions
12536 Ruby master Bug Closed SIGABRT during GC on Debian GNU/Linux 8 (x86_64) due to insufficient string buffer allocation related with term fill 09/30/2016 03:42 PM Actions
10037 Ruby master Bug Closed Since r46798 on Solaris, "[BUG] rb_vm_get_cref: unreachable" during make ko1 (Koichi Sasada) 07/21/2015 10:53 PM Actions
11644 Ruby master Bug Closed Since r52055, TestMkmf::TestConvertible failed on Solaris 10 with fcc 11/06/2015 09:19 AM Actions
11645 Ruby master Bug Closed Since r52422, failed to compile parse.y on Solaris 10 with Oracle Solaris Studio 12.3 11/02/2015 05:10 PM Actions
12470 Ruby master Bug Closed Since r54952, TestMkmf::TestConvertible failed on Solaris 10 with Oracle SolarisStudio 12.x cc ngoto (Naohisa Goto) 06/08/2016 11:37 AM Actions
12397 Ruby master Bug Closed Since r54986, syntax error with Oracle Solaris Studio 12.x on Solaris 10 06/08/2016 05:18 AM Actions
12406 Ruby master Bug Closed Since r55002, Bus Error on 64-bit SPARC on Solaris 10 06/08/2016 05:17 AM Actions
12769 Ruby master Bug Closed Since r56098, compile error in ossl_ssl.c line 639, with old version of fcc on Solaris 10 09/16/2016 01:13 PM Actions
12768 Ruby master Bug Closed Since r56158, compile error in "hash.c", line 1753, with old fcc on Solaris 10 09/16/2016 12:20 PM Actions
12767 Ruby master Bug Closed Since r56169, compile error of vsnprintf.c with Oracle Solaris Studio 12.x 09/18/2016 10:40 AM Actions
(1-100/137) Per page: 50, 100, 200

Also available in: Atom CSV PDF