Project

General

Profile

Issues

Filters

Apply Clear

# Project Tracker Status Subject Assignee Updated
14875 Ruby master Bug Closed /bin/sh: bad substitution 06/17/2019 11:25 PM Actions
14200 Ruby master Bug Closed addr2line.c compile error with C89 compilers on Solaris 10 01/06/2019 02:17 PM Actions
15292 Ruby master Bug Third Party's Issue Since r64852, on Solaris with Oracle Developer Studio 12.6, compile error of iseq.c ngoto (Naohisa Goto) 12/11/2018 12:36 AM Actions
15293 Ruby master Bug Closed Since r64852, on Solaris with Oracle Developer Studio 12.4, syntax error 12/10/2018 02:04 PM Actions
15319 Ruby master Bug Closed Since r65735, tool/mjit_archflag.sh related error on Solaris 10 nobu (Nobuyoshi Nakada) 11/22/2018 06:09 AM Actions
14963 Ruby master Bug Open Since r64107, on Solaris, spec test of rb_io_wait_readable hangs up 08/03/2018 02:49 PM Actions
14876 Ruby master Bug Closed /bin/sh: bad substitution since r63679 on Solaris nobu (Nobuyoshi Nakada) 07/02/2018 01:51 PM Actions
14826 Ruby master Bug Open make: *** [.ext/include/sparc-solaris2.10/rb_mjit_min_header-2.6.0.h] Error 1 on Solaris 10 with very old gcc3 06/05/2018 02:02 PM Actions
14786 Ruby master Bug Closed PTY duplicated "\r" problem on Solaris 05/23/2018 03:59 PM Actions
14761 Ruby master Bug Open TestThread#test_join_limits hangs up on Solaris 10 with gcc 05/16/2018 05:23 AM Actions
14751 Ruby master Bug Closed error during transform_mjit_header.rb on Solaris 10 05/11/2018 04:48 PM Actions
14746 Ruby master Bug Closed $cppflags が ext/zlib/Makefile に反映されないため(?) Solaris 10 にて ext/zlib のmakeに失敗する 05/11/2018 03:46 PM Actions
14446 Ruby master Bug Closed Solaris 10 上の Oracle Developer Studio 12.5 および 12.6 の64ビットコンパイル時のmjit関係のエラー 02/08/2018 02:15 PM Actions
14447 Ruby master Bug Rejected Solaris 10 上の古いFujitsu C Compiler(fcc)のmjit関係のエラー 02/07/2018 12:34 PM Actions
14260 Ruby master Bug Closed test failure related with proc arity on 32-bit environment (e.g. Solaris 10 with 32-bit compile) 01/07/2018 10:25 PM Actions
11684 Ruby master Bug Closed Pack#unpack test failure on Solaris 10 with Oracle Solaris Studio 12.4 ngoto (Naohisa Goto) 12/19/2017 04:55 PM Actions
14199 Ruby master Bug Closed eval_error.c compile error with Oracle Solaris Studio (Oracle Developer Studio) 12.4 on Solaris 10 12/18/2017 04:02 PM Actions
13658 Ruby master Bug Closed Compile error with Oracle Solaris Studio (Oracle Developer Studio) 12.4 in compile.c line 1622 (definition of BADINSN_ERROR) 06/14/2017 04:27 AM Actions
13522 Ruby master Bug Closed Solaris10上で make update-rubyspec が bad substitution で失敗 04/30/2017 10:53 AM Actions
13433 Ruby master Bug Closed Solaris10上で make update-rubyspec が失敗 04/14/2017 12:45 AM Actions
13424 Ruby master Bug Closed Solaris10上で make update-rubyspec が bad substitution で失敗 04/13/2017 07:52 AM Actions
13059 Ruby master Bug Closed "regcomp.c", line 2236: error: syntax error near `/' with old fcc on Solaris 10 ngoto (Naohisa Goto) 12/21/2016 03:21 PM Actions
12527 Ruby master Bug Closed warning: macro redefined: REG_PC and REG_SP on Solaris 10 ko1 (Koichi Sasada) 11/05/2016 04:31 PM Actions
12537 Ruby master Bug Closed Fiddle::TestPointer#test_to_s and test_to_str destroy literal string data 09/30/2016 03:44 PM Actions
12536 Ruby master Bug Closed SIGABRT during GC on Debian GNU/Linux 8 (x86_64) due to insufficient string buffer allocation related with term fill 09/30/2016 03:42 PM Actions
12767 Ruby master Bug Closed Since r56169, compile error of vsnprintf.c with Oracle Solaris Studio 12.x 09/18/2016 10:40 AM Actions
12769 Ruby master Bug Closed Since r56098, compile error in ossl_ssl.c line 639, with old version of fcc on Solaris 10 09/16/2016 01:13 PM Actions
12768 Ruby master Bug Closed Since r56158, compile error in "hash.c", line 1753, with old fcc on Solaris 10 09/16/2016 12:20 PM Actions
12701 Ruby master Bug Closed compile error about ALWAYS_INLINE 08/24/2016 11:13 AM Actions
12575 Ruby master Bug Closed Conditional jump or move depends on uninitialised value(s) at rb_wait_for_single_fd (thread.c:3864) 08/18/2016 02:05 PM Actions
12524 Ruby master Bug Closed Excess semicolons in ext/digest and ext/openssl 08/16/2016 03:13 AM Actions
12559 Ruby master Bug Closed ./enc/iso_8859_14.c, line 253: error: syntax error near / with old fcc on Solaris 10 08/04/2016 07:43 AM Actions
12479 Ruby master Bug Closed mistaken macro GCC_VERSION_SINCE 08/04/2016 05:59 AM Actions
12471 Ruby master Bug Closed make update-mspec always fails on Solaris 08/04/2016 05:45 AM Actions
12470 Ruby master Bug Closed Since r54952, TestMkmf::TestConvertible failed on Solaris 10 with Oracle SolarisStudio 12.x cc ngoto (Naohisa Goto) 06/08/2016 11:37 AM Actions
12397 Ruby master Bug Closed Since r54986, syntax error with Oracle Solaris Studio 12.x on Solaris 10 06/08/2016 05:18 AM Actions
12406 Ruby master Bug Closed Since r55002, Bus Error on 64-bit SPARC on Solaris 10 06/08/2016 05:17 AM Actions
10384 Ruby master Bug Closed Fiddle::DLError: unknown symbol "Init_objspace" during Fiddle::TestHandle#test_NEXT and Fiddle::TestHandle#test_static_sym on Solaris 03/28/2016 05:50 PM Actions
11843 Ruby master Bug Closed enc/windows_1250.c syntax error with fcc on Solaris -- C++(C99)-style comments should not be used 03/25/2016 08:19 AM Actions
11742 Ruby master Bug Closed lib/webrick/utils.rb:196:in `register': ERROR RuntimeError: can't add a new key into hash during iteration nahi (Hiroshi Nakamura) 02/03/2016 11:30 AM Actions
11853 Ruby master Bug Closed "variable.c line 43: warning: modification of typedef with int ignored" on Solaris 02/03/2016 10:38 AM Actions
11944 Ruby master Bug Closed ruby lib version (2.4.0) doesn't match executable version (RUBY_PROGRAM_VERSION_MAJOR.RUBY_PROGRAM_VERSION_MINOR.0) (RuntimeError) ngoto (Naohisa Goto) 01/04/2016 03:12 AM Actions
11821 Ruby master Bug Closed warning: syntax error: empty declaration in gc.c because of semicolon after RUBY_ALIAS_FUNCTION() 12/15/2015 02:20 PM Actions
11780 Ruby master Bug Closed TestIO_Console#test_getpass failed on Solaris 12/08/2015 04:04 AM Actions
11743 Ruby master Bug Closed r52758 以降 config.guess がダウンロードできない 12/07/2015 07:28 AM Actions
11728 Ruby master Bug Closed TestSocket#test_timestamp failure on Solaris 10 with -D_XOPEN_SOURCE=500 11/21/2015 04:19 PM Actions
11709 Ruby master Bug Closed TestSocket#test_udp_recvmsg_truncation failure on Solaris 10 11/18/2015 05:22 PM Actions
11697 Ruby master Bug Closed test/dtrace failure on Solaris 10 11/16/2015 12:38 PM Actions
11644 Ruby master Bug Closed Since r52055, TestMkmf::TestConvertible failed on Solaris 10 with fcc 11/06/2015 09:19 AM Actions
11645 Ruby master Bug Closed Since r52422, failed to compile parse.y on Solaris 10 with Oracle Solaris Studio 12.3 11/02/2015 05:10 PM Actions
(1-50/137) Per page: 50, 100, 200

Also available in: Atom CSV PDF